program: Gaussian 09
title: 000227153
version: EM64L-G09RevD.01
frameworkgroup: C1[X(C22H18N2O)]
method: RPBEPBE
basis: SDD
operation: Freq
keyword: #p
keyword: freq=noraman
keyword: PBEPBE/SDD
title: #p freq=noraman PBEPBE/SDD
converged: NO YES NO NO
title: Mulliken charges:
elementType: O N N C C C C C C C C C C C C C C C C C C C C C C H H H H H H H H H H H H H H H H H H
charge: -0.246501 0.018411 -0.450604 0.249577 0.314389 0.248624 0.275903 -0.514847 -0.576610 -0.398072 -0.421498 -0.383128 0.533861 -0.487758 -0.225352 -0.269142 0.311033 -0.379596 -0.379527 0.429287 -0.374873 -0.372669 0.207713 -0.810109 -0.801102 0.357269 0.246776 0.246395 0.287338 0.220462 0.229105 0.232603 0.309698 0.247029 0.246968 0.228092 0.228002 0.224146 0.224018 0.230650 0.237959 0.271077 0.235004
chargesum: 0.00000
title: Mulliken charges with hydrogens summed into heavy atoms:
elementType: O N N C C C C C C C C C C C C C C C C C C C C C C
charge: -0.246501 0.018411 -0.140906 0.249577 0.314389 0.248624 0.275903 -0.514847 -0.219340 -0.151295 -0.175103 -0.095790 0.533861 -0.267297 0.003753 -0.036539 0.311033 -0.132567 -0.132559 0.429287 -0.146781 -0.144667 0.207713 -0.131296 -0.057062
polarizability: 4.16510922e+02 6.74094078e+00 3.02379244e+02 -1.00728984e-01 1.93902482e-01 1.44850725e+02
1716.lowfreq: -77.3478 -58.7304 -34.5981 -4.8845 -3.8880 -0.0006 0.0001 0.0006 3.1497
frequency: -77.3445 -58.6518 -34.5939 33.2534 36.2607 39.2222 57.8047 84.1120 102.2448 124.7786 135.6607 147.9828 169.6139 214.6478 229.1116 281.0877 308.6808 314.9838 348.5599 348.6425 394.6590 398.7011 426.6334 436.1326 446.9540 463.2251 509.8611 512.5593 526.1550 546.7676 563.9183 571.4334 604.7238 637.5494 640.4504 641.0261 657.5610 681.0193 697.4966 717.1767 736.2316 757.6546 762.6402 797.8211 811.0843 825.1729 827.3794 832.8673 841.7105 856.5172 898.9120 928.2488 938.0008 949.4650 959.3809 961.9500 962.8759 974.3297 984.2014 987.9631 993.7819 1003.9951 1006.7687 1029.8409 1036.1641 1044.6246 1075.9463 1116.7751 1117.0678 1143.4266 1169.7284 1183.6840 1188.4531 1208.6679 1221.2308 1224.5177 1236.8111 1275.2224 1280.8659 1297.6767 1307.8464 1347.8655 1367.7165 1373.8916 1387.9661 1396.9535 1408.4577 1440.8531 1446.0010 1452.9838 1465.2981 1467.7981 1470.6105 1472.7860 1486.9321 1492.2965 1513.5974 1565.9581 1592.9031 1601.1024 1610.6483 1618.0122 1627.0989 1636.9325 1654.8905 2970.9416 2986.9366 3051.0296 3072.0617 3081.5922 3111.8278 3118.0556 3120.3170 3126.6290 3136.8803 3141.1675 3147.0162 3151.0348 3155.5824 3157.3573 3174.4355 3195.7277 3521.5754
redmass: 1.0434 1.0209 3.8076 4.7319 6.4889 4.3893 4.4614 5.3576 4.2022 4.9244 4.2619 4.0474 6.3804 5.2932 4.8116 4.0944 4.7837 2.9343 5.1733 4.7806 2.9868 3.6377 4.8115 3.6071 4.7823 3.5459 4.2107 4.3384 4.7879 4.6419 4.9810 3.0962 3.1987 3.2737 1.4959 6.1122 5.9134 3.7063 5.4223 3.2210 5.4629 1.3919 4.8006 2.6521 3.3342 2.1343 2.6221 1.2697 1.9241 5.7450 1.6107 6.4571 1.3232 1.4368 1.3784 2.4957 1.4045 1.4829 1.4060 3.0413 1.3474 2.7779 2.8467 1.6637 1.9890 1.5354 3.2263 1.9549 1.2879 1.6392 1.3000 1.1840 1.7411 2.2480 2.7976 2.3474 2.8674 2.0306 1.6907 1.3165 2.0790 4.5850 5.3738 1.2806 3.9848 1.2240 3.5648 1.8627 1.9907 1.6311 4.2860 1.0473 1.0954 1.0540 3.1872 3.2463 1.9793 5.9131 6.7914 6.8375 7.1818 6.3752 7.3551 5.1723 11.9236 1.0391 1.0383 1.0944 1.0984 1.0996 1.0886 1.0887 1.0885 1.0861 1.0978 1.0912 1.0953 1.0948 1.0961 1.0958 1.0978 1.0936 1.0763
irintensity: 0.0124 0.4584 0.4083 0.7888 2.8169 3.3427 7.0941 0.9262 0.2880 0.2024 1.8977 0.0744 5.0834 0.3771 0.0085 1.2168 1.6843 0.0284 2.4470 1.4721 0.0090 1.6461 0.9814 0.5052 16.8793 8.4924 5.1380 7.4961 7.7036 3.8001 11.9913 3.5170 11.7681 18.0673 36.6501 9.5389 6.1468 1.1245 1.7565 5.5439 1.4847 82.7737 4.4052 16.1185 12.3236 31.8102 19.8805 0.3882 27.3803 31.6221 0.0995 4.5993 0.2889 0.5339 0.0062 39.7843 0.1630 24.8639 0.2016 16.9116 0.0070 4.3420 6.4845 7.6032 3.7668 14.9511 5.0576 18.1336 15.8051 26.2859 13.3790 0.1784 15.2164 14.6039 2.9987 21.2565 139.4947 10.2194 24.9830 0.0624 26.8560 1.5839 77.5026 83.3701 74.9031 5.9484 0.0454 34.4752 104.2321 17.2996 185.0086 19.6705 11.0409 8.9526 152.6584 201.2419 173.2581 3.0407 5.1851 41.1128 72.8348 25.3972 16.6707 77.2997 219.3714 57.8113 10.5602 25.6102 15.4670 18.9685 26.4401 14.6416 28.0571 3.2069 6.5608 6.7843 21.3049 19.9307 0.0182 30.1724 16.1806 9.8340 12.9067
temp: 298.150 k
press: 1.00000 atm
elementType: 8 7 7 6 6 6 6 6 6 6 6 6 6 6 6 6 6 6 6 6 6 6 6 6 6 1 1 1 1 1 1 1 1 1 1 1 1 1 1 1 1 1 1
symmnumber: 1
zpe: 886001.4 jmol-1
zpe.correction: 0.337460 hartree
zpe.thermalcorrener: 0.356596 hartree
zpe.thermalcorrenthalpy: 0.357540 hartree
zpe.thermalcorrgfe: 0.288749 hartree
zpe.sumelectzpe: -1032.186791 hartree
zpe.sumelectthermal: -1032.167655 hartree
zpe.sumelectthermalent: -1032.166711 hartree
zpe.sumelectthermalfe: -1032.235502 hartree
dipole: -2.8278 4.0804 0.0117
dipole: 4.9645
quadrupole: -92.2966 -144.4508 -145.1272
quadrupole: -4.4826 -0.0872 0.0193
quadrupole: 34.9949 -17.1593 -17.8356 -4.4826 -0.0872 0.0193
hfenergy: -1032.5242514 hartree
pointgroup: C01 [X(C22H18N2O1)]
dipole: 1.0538251 -1.6445025 0.0060994 debye
polarizability: 416.8487116|2.6032774|302.040865|0.0139154|-0.3698566|144.8513141 unknown
InChI: InChI=1S/C22H18N2O/c1-14-7-9-16(10-8-14)24-22-20-6-4-3-5-18(20)19-12-11-17(13-21(19)22)23-15(2)25/h3-13,23H,1-2H3
charge 0 multiplicity 1
43 atoms
O  3.905537 2.819255 -0.007681
N  -0.693305 0.993377 -0.001322
N  4.798477 0.646225 -0.001192
C  1.423314 -1.939616 0.001595
C  1.238556 -0.526327 0.000257
C  0.093874 -2.587238 0.001937
C  -0.914137 -1.568468 0.000904
C  -0.229536 -0.227904 -0.00024
C  2.309834 0.3770 -0.000643
C  2.727559 -2.468135 0.002185
C  -0.266043 -3.947314 0.002892
C  -2.28046 -1.909197 0.000621
C  3.628382 -0.163999 -0.000181
C  3.822063 -1.576407 0.001286
C  -1.642833 -4.287541 0.002692
C  -2.639096 -3.281612 0.001491
C  -2.075699 1.331184 -0.000688
C  -2.761756 1.554079 1.223325
C  -2.758038 1.570029 -1.223795
C  -4.808663 2.201163 0.000842
C  -4.107033 1.978853 1.214169
C  -4.103364 1.994319 -1.213191
C  4.902715 2.043215 -0.002963
C  -6.265435 2.633243 0.001179
C  6.347082 2.547387 -0.000403
H  2.148069 1.455923 -0.001918
H  2.906181 -3.548526 0.003255
H  0.49581 -4.734565 0.003719
H  -3.053246 -1.136268 -0.00022
H  4.843883 -1.978266 0.001655
H  -1.940512 -5.34223 0.003432
H  -3.696972 -3.565145 0.00127
H  5.683484 0.132929 -0.000229
H  -2.231444 1.401481 2.169137
H  -2.224731 1.42983 -2.169825
H  -4.619183 2.144194 2.170325
H  -4.612675 2.171844 -2.168697
H  -6.504825 3.250533 -0.882992
H  -6.512897 3.221664 0.902564
H  -6.945688 1.758905 -0.016243
H  6.880018 2.231575 0.915807
H  6.332731 3.645812 -0.038045
H  6.909701 2.16894 -0.874074
