program: Gaussian 09
title: 000227152
version: EM64L-G09RevD.01
frameworkgroup: C1[X(C20H14N2O2)]
method: RPBEPBE
basis: SDD
operation: Freq
keyword: #p
keyword: freq=noraman
keyword: PBEPBE/SDD
title: #p freq=noraman PBEPBE/SDD
converged: YES YES NO NO
title: Mulliken charges:
elementType: O O N N C C C C C C C C C C C C C C C C C C C C H H H H H H H H H H H H H H
charge: -0.212513 -0.203041 0.017062 0.017739 0.243316 0.320428 0.244063 0.282114 -0.488601 -0.587784 -0.372867 -0.405813 -0.375900 0.410974 -0.384661 -0.222475 -0.258057 0.308442 -0.378939 -0.379082 0.428511 -0.372443 -0.370695 -0.807207 0.335577 0.257131 0.252618 0.291496 0.289769 0.236568 0.238471 0.248657 0.248652 0.231770 0.231737 0.232447 0.226206 0.226329
chargesum: 0.00000
title: Mulliken charges with hydrogens summed into heavy atoms:
elementType: O O N N C C C C C C C C C C C C C C C C C C C C
charge: -0.212513 -0.203041 0.017062 0.017739 0.243316 0.320428 0.244063 0.282114 -0.488601 -0.252207 -0.115736 -0.153195 -0.084404 0.410974 -0.094892 0.014093 -0.019586 0.308442 -0.130283 -0.130431 0.428511 -0.140673 -0.138958 -0.122225
polarizability: 4.03305521e+02 1.79996848e+01 2.77713332e+02 -2.44037119e-02 -1.01583123e-02 1.31183821e+02
1716.lowfreq: -48.0070 -40.0567 -5.0737 -0.0005 0.0003 0.0008 0.9361 4.4038 35.7578
frequency: -48.0019 -39.9977 35.7577 38.9013 53.0311 62.5332 104.2476 110.4875 138.2391 147.3032 177.2075 205.9720 235.5765 304.6830 306.0046 324.2233 325.7154 392.8704 398.8315 432.5587 437.9692 442.8067 478.2660 498.9674 507.4976 515.5431 533.9471 559.5646 574.4066 635.4794 635.8014 654.7907 664.4390 699.4204 706.6561 717.0180 732.9545 756.7844 757.7293 800.3974 801.9762 823.5227 825.5818 835.0975 846.6624 867.1954 904.4655 939.7647 956.9632 962.6611 966.1464 972.5652 984.3760 992.5824 997.8095 999.6184 1007.0782 1034.3765 1046.0660 1056.6941 1087.7238 1118.3457 1124.9878 1142.0395 1174.4802 1186.7626 1200.4346 1207.1402 1221.4808 1226.3155 1245.5126 1274.7348 1300.8142 1305.4752 1348.8582 1359.4553 1386.7163 1397.8038 1407.6257 1408.7247 1439.4823 1445.5964 1460.3392 1470.2748 1473.4700 1482.4234 1492.3669 1567.5752 1591.5055 1597.8664 1608.7283 1616.7657 1620.9894 1652.7208 2972.8483 3053.5899 3083.9616 3121.5812 3123.6337 3133.5394 3145.9462 3150.5965 3152.2193 3156.7675 3162.6206 3178.2682 3184.7802 3186.5503
redmass: 1.3189 2.0925 5.0204 5.4573 8.4426 7.5795 7.2226 4.5978 4.4625 4.5063 5.6666 6.3730 7.2575 6.1426 3.9656 3.5444 5.4292 3.0651 3.5488 3.7962 5.3356 3.5620 7.4342 6.3697 4.5252 4.5036 4.8274 3.7864 4.8765 6.8139 7.0524 5.0991 7.2516 5.5542 5.3315 3.3182 5.7673 6.2286 1.4332 2.8825 6.2133 1.6550 2.7676 1.2504 6.8192 1.5885 1.6625 1.3739 4.2708 1.3676 1.4154 1.5455 1.4054 1.3761 6.3901 1.3560 2.8952 2.1052 1.5360 2.1154 2.6283 1.2941 1.7087 2.0313 1.2086 1.1469 2.2328 5.9630 2.9054 2.6690 2.8269 1.7038 1.3116 1.7702 4.7127 9.8689 7.7224 1.2253 3.4535 3.6299 2.5215 3.7681 2.9603 1.0957 1.0541 3.8064 3.1511 5.9660 6.6822 8.4165 7.1218 6.4383 7.8006 12.0819 1.0391 1.0945 1.0996 1.0886 1.0885 1.0864 1.0912 1.0908 1.0950 1.0963 1.0963 1.0979 1.0942 1.0940
irintensity: 0.8084 0.0177 0.5522 0.1623 0.0220 0.4024 0.7496 0.3575 0.3910 1.2306 3.0063 2.4993 0.3625 0.7042 0.5693 0.6550 1.6572 0.0066 1.2544 0.3918 10.2991 4.4937 0.4920 5.1769 2.3113 6.7600 6.7144 0.0750 11.2214 0.2635 1.6897 12.9603 16.3095 0.2684 9.7791 6.8351 4.1943 18.3890 75.2821 4.0936 7.5348 43.9334 12.8313 0.2163 4.3832 25.0170 0.0184 1.3322 18.9047 0.0219 2.9006 18.5978 0.2307 0.5547 4.2091 0.0053 12.0444 2.6449 14.5070 49.4984 9.9091 15.5634 17.8589 33.4834 8.6674 1.4302 42.5151 486.5718 2.4620 39.3758 60.4629 13.6973 0.0696 4.6880 1.3586 89.3194 10.0254 7.4992 0.0017 30.0504 16.4054 34.1107 0.7633 11.7953 12.8220 1.5683 125.0824 2.9543 0.8729 11.1584 66.8588 32.2654 95.9975 123.5041 50.4595 24.0805 17.8523 11.9304 24.2396 1.5510 5.3194 8.8183 18.2113 0.3326 23.6856 13.7013 0.8333 7.4916
temp: 298.150 k
press: 1.00000 atm
elementType: 8 8 7 7 6 6 6 6 6 6 6 6 6 6 6 6 6 6 6 6 6 6 6 6 1 1 1 1 1 1 1 1 1 1 1 1 1 1
symmnumber: 1
zpe: 749928.3 jmol-1
zpe.correction: 0.285633 hartree
zpe.thermalcorrener: 0.303296 hartree
zpe.thermalcorrenthalpy: 0.304241 hartree
zpe.thermalcorrgfe: 0.238875 hartree
zpe.sumelectzpe: -1028.781809 hartree
zpe.sumelectthermal: -1028.764146 hartree
zpe.sumelectthermalent: -1028.763202 hartree
zpe.sumelectthermalfe: -1028.828567 hartree
dipole: 5.0300 6.6661 -0.0026
dipole: 8.3509
quadrupole: -143.4971 -137.4353 -135.3053
quadrupole: -20.9267 -0.0097 0.0010
quadrupole: -4.7513 1.3106 3.4406 -20.9267 -0.0097 0.0010
hfenergy: -1029.067442 hartree
pointgroup: C01 [X(C20H14N2O2)]
dipole: -2.1109553 -2.5176294 -0.0010115 debye
polarizability: 404.8197731|11.4681083|276.1990806|0.0248929|0.0088926|131.183821 unknown
InChI: InChI=1S/C20H14N2O2/c1-13-6-8-14(9-7-13)21-20-18-5-3-2-4-16(18)17-11-10-15(22(23)24)12-19(17)20/h2-12H,1H3
charge 0 multiplicity 1
38 atoms
O  5.994121 1.432998 0.000149
O  4.322433 2.986102 -0.000118
N  -0.705204 1.149646 0.000258
N  4.743841 1.764793 0.000021
C  1.868627 -1.395157 -0.000115
C  1.444706 -0.030946 0.000005
C  0.66561 -2.252918 -0.000168
C  -0.498387 -1.416598 -0.000044
C  -0.050837 0.019592 0.000158
C  2.36134 1.025823 0.000035
C  3.242316 -1.713036 -0.000196
C  0.54451 -3.654688 -0.000329
C  -1.787209 -1.984569 -0.00008
C  3.734674 0.680437 -0.00003
C  4.185099 -0.662432 -0.000146
C  -0.75378 -4.222679 -0.000364
C  -1.905138 -3.397653 -0.000237
C  -2.127627 1.251186 0.000131
C  -2.838737 1.361552 1.224045
C  -2.838543 1.361245 -1.223998
C  -4.966196 1.643056 -0.000193
C  -4.236945 1.550778 1.213651
C  -4.236676 1.55048 -1.213936
C  -6.47427 1.825065 -0.000566
H  2.041662 2.070529 0.000132
H  3.585319 -2.752361 -0.00031
H  1.429202 -4.300315 -0.000435
H  -2.680958 -1.355819 0.000039
H  5.261041 -0.855201 -0.000188
H  -0.869871 -5.311877 -0.000493
H  -2.899476 -3.856413 -0.000251
H  -2.290394 1.309495 2.17039
H  -2.289985 1.308944 -2.170209
H  -4.768831 1.633901 2.16945
H  -4.768396 1.633364 -2.169863
H  -6.997819 0.848923 -0.010484
H  -6.816115 2.370164 0.896906
H  -6.813707 2.386791 -0.888718
