program: Gaussian 09
title: 000227151
version: EM64L-G09RevD.01
frameworkgroup: C1[X(C27H23NO)]
method: RPBEPBE
basis: SDD
operation: Freq
keyword: #p
keyword: freq=noraman
keyword: PBEPBE/SDD
title: #p freq=noraman PBEPBE/SDD
converged: YES YES NO NO
title: Mulliken charges:
elementType: O N C C C C C C C C C C C C C C C C C C C C C C C C C C C H H H H H H H H H H H H H H H H H H H H H H H
charge: -0.439240 -0.218773 0.325232 -0.462108 0.184618 0.330364 0.167808 0.481462 -0.606162 -0.428432 -0.402018 -0.557640 -0.557860 -0.420052 -0.402343 -0.242090 -0.232523 0.432974 0.426268 -0.370288 -0.368052 -0.406922 -0.403321 -0.243860 -0.249852 -0.222104 -0.223210 -0.240442 -0.239851 0.219017 0.250872 0.237503 0.244407 0.249297 0.248395 0.252583 0.245760 0.254658 0.237015 0.347087 0.223957 0.222505 0.257429 0.261229 0.231021 0.231126 0.228569 0.231204 0.226816 0.227220 0.229947 0.230800
chargesum: 0.00000
title: Mulliken charges with hydrogens summed into heavy atoms:
elementType: O N C C C C C C C C C C C C C C C C C C C C C C C C C C C
charge: -0.092153 -0.218773 0.325232 -0.243091 0.184618 0.330364 0.167808 0.481462 -0.355290 -0.190929 -0.157611 -0.059948 -0.059516 -0.165395 -0.165328 -0.018134 -0.010018 0.432974 0.426268 -0.112859 -0.106823 -0.175902 -0.172196 -0.015291 -0.018648 0.004712 0.004010 -0.010495 -0.009051
polarizability: 4.55453056e+02 -9.96550704e+00 3.09325160e+02 -3.61043515e+00 6.47863106e+00 1.98173382e+02
1716.lowfreq: -15.4075 -7.8110 -3.9139 0.0003 0.0005 0.0007 14.0035 18.5618 21.8768
frequency: 10.3145 18.4252 21.3929 27.0296 33.8481 41.5311 63.0797 102.1781 113.6271 121.5851 148.3098 157.4496 167.3373 187.3753 203.7781 216.5266 232.6486 245.2233 306.7956 313.9777 354.9164 361.4656 384.3019 403.3832 403.9461 434.4563 443.2209 457.3582 457.9822 461.5131 508.4441 538.0997 540.4787 557.3369 578.4332 600.4740 602.7628 614.3493 615.6975 635.7488 664.4256 703.0246 704.3024 705.8903 723.1932 736.0242 740.2226 747.8761 764.2754 779.5344 785.4042 788.2754 822.7455 825.8889 852.2242 857.6080 861.9462 878.2060 888.0957 902.7136 906.7925 944.7462 946.4270 961.5061 970.0616 973.5988 979.8483 982.1527 982.5783 989.2835 989.3529 993.3181 998.6768 999.7418 1023.7474 1025.1358 1026.3333 1052.2876 1082.6689 1086.2582 1093.9911 1124.6303 1147.3312 1157.4272 1166.2906 1170.2997 1171.9905 1172.5058 1183.4653 1184.7098 1187.2461 1195.9474 1203.6612 1227.8284 1235.3863 1255.6655 1267.7759 1290.6697 1297.6526 1302.3936 1305.7317 1335.2497 1343.2399 1346.0256 1365.0708 1382.9601 1386.8776 1392.8888 1400.3746 1437.6713 1439.8715 1446.8376 1458.5985 1464.3214 1468.1792 1477.8980 1483.1567 1486.2268 1503.7700 1583.7548 1593.3261 1594.2806 1595.6764 1613.3752 1613.7225 1621.3343 1633.2410 2932.2124 2966.4849 2972.6738 3018.4415 3023.2862 3110.7009 3110.9819 3121.7706 3124.8479 3125.2650 3126.3355 3128.5465 3134.2710 3136.8686 3137.6035 3146.2746 3147.6615 3148.3733 3157.2867 3162.3848 3163.1189 3163.7007 3545.6882
redmass: 5.3078 5.4277 4.1504 4.8672 4.6323 4.1303 4.8489 4.1783 4.6198 5.0023 4.0125 5.4586 4.6547 4.2685 1.3372 3.5066 3.7829 4.1942 4.1702 4.6520 3.1839 4.7738 3.5455 2.8340 2.8467 3.2538 3.2013 2.6418 2.8671 3.4638 4.7224 4.5007 5.1721 4.7784 4.3636 4.8283 4.1003 6.4107 6.3707 4.9282 4.9851 2.4581 2.8497 3.2299 4.8598 1.4073 1.4616 1.5565 3.7941 3.3049 3.2162 4.4218 1.6734 2.4171 1.6203 1.2503 1.3108 1.6414 3.4632 1.3713 1.3997 1.5284 1.3789 2.5591 2.1102 3.5856 1.3995 1.3904 1.3472 6.0002 5.8352 3.2339 1.4890 1.4090 2.1483 2.2122 2.2333 2.0916 1.5864 1.6497 1.9412 2.3534 1.2615 2.4003 1.2883 1.2951 1.0532 1.0528 1.5622 1.1620 1.1366 2.6580 2.3502 1.4424 1.5703 1.5641 1.4833 1.3787 1.4623 1.4581 1.8282 1.6618 1.3461 1.3924 6.3156 4.6314 5.3489 3.4327 2.4936 2.1420 2.1428 2.5518 1.5664 2.7589 1.4126 2.2634 2.0170 1.7349 3.6151 7.2137 6.0826 6.1048 6.6320 5.9159 5.9104 7.2367 7.0862 1.0825 1.0617 1.0613 1.0997 1.0996 1.0877 1.0877 1.0853 1.0859 1.0886 1.0877 1.0884 1.0895 1.0912 1.0912 1.0948 1.0954 1.0953 1.0945 1.1002 1.1014 1.1013 1.0663
irintensity: 0.0511 0.0422 0.2322 0.0683 0.2112 0.0566 0.4375 4.1908 0.2308 0.3166 1.3331 3.3017 1.8850 9.1177 116.8729 23.7321 9.2348 8.1498 3.7718 0.8371 3.0494 5.3105 2.8237 0.0493 0.0955 2.6976 0.6474 11.9859 6.0363 6.6426 2.1196 1.0393 4.4366 4.2102 2.8294 14.5490 7.3541 0.3202 0.3828 12.5195 0.5523 16.5028 18.0913 20.2683 0.6557 43.8088 71.2581 65.2596 23.3254 17.0545 13.4606 3.2485 24.1417 3.8969 23.3366 0.6686 5.0968 7.0909 10.6574 1.8203 8.8226 14.9222 1.5267 63.4536 6.4615 44.4278 0.6654 0.8467 1.1219 1.5706 0.7171 6.8311 4.4520 1.3479 13.9662 13.1384 10.8122 6.1674 8.8094 10.0014 7.6799 19.0744 48.4084 20.3797 8.5820 8.4319 0.1301 0.1075 7.4475 13.3839 12.4107 0.3176 31.4324 46.5733 99.3966 33.5997 10.3670 7.2998 22.5775 19.5791 1.9348 7.9490 5.6900 48.1102 13.0847 75.0467 3.7403 5.3779 10.7833 8.3302 48.9665 17.5692 63.7914 56.3325 61.3535 32.3992 15.8933 14.5379 174.4432 31.7865 1.0931 0.4748 1.4206 15.2370 22.8409 110.3781 168.5513 38.6535 33.1939 35.1890 8.0954 11.4602 9.2792 8.2647 6.3749 1.0806 18.0704 7.4869 7.1152 4.5808 15.4072 15.2815 28.8670 43.0094 34.4088 18.8685 44.3930 30.0973 21.2305 4.3019
temp: 298.150 k
press: 1.00000 atm
elementType: 8 7 6 6 6 6 6 6 6 6 6 6 6 6 6 6 6 6 6 6 6 6 6 6 6 6 6 6 6 1 1 1 1 1 1 1 1 1 1 1 1 1 1 1 1 1 1 1 1 1 1 1
symmnumber: 1
zpe: 1100256.4 jmol-1
zpe.correction: 0.419066 hartree
zpe.thermalcorrener: 0.443191 hartree
zpe.thermalcorrenthalpy: 0.444135 hartree
zpe.thermalcorrgfe: 0.361161 hartree
zpe.sumelectzpe: -1170.647800 hartree
zpe.sumelectthermal: -1170.623674 hartree
zpe.sumelectthermalent: -1170.622730 hartree
zpe.sumelectthermalfe: -1170.705704 hartree
dipole: -4.0155 -0.1727 0.8901
dipole: 4.1166
quadrupole: -164.8351 -157.2547 -164.2242
quadrupole: -5.4527 2.2194 4.3118
quadrupole: -2.7304 4.8500 -2.1196 -5.4527 2.2194 4.3118
hfenergy: -1171.0668653 hartree
pointgroup: C01 [X(C27H23N1O1)]
dipole: 1.5225985 -0.4927462 -0.2490459 debye
polarizability: 453.155408|-22.3664363|288.9374595|-9.1450318|-44.2709387|220.8587295 unknown
InChI: InChI=1S/C27H23NO/c29-27-25-14-8-7-13-23(25)24-16-15-22(17-26(24)27)28(18-20-9-3-1-4-10-20)19-21-11-5-2-6-12-21/h1-17,27,29H,18-19H2
charge 0 multiplicity 1
52 atoms
O  -2.99597 2.630911 -1.371966
N  1.539665 -0.290564 0.123179
C  -2.078344 0.434164 -0.487914
C  -3.137058 1.157972 -1.328484
C  -2.703532 -0.273009 0.579086
C  -4.433134 0.798018 -0.611719
C  -4.161878 -0.058427 0.497851
C  0.137725 -0.28713 0.261744
C  -0.690113 0.442694 -0.654755
C  -1.900406 -0.999505 1.481898
C  -0.49928 -1.011655 1.320412
C  2.43257 -0.680552 1.223029
C  2.202026 0.105968 -1.126648
C  -5.740745 1.200889 -0.914545
C  -5.220647 -0.530279 1.302897
C  -6.805267 0.731515 -0.100459
C  -6.543601 -0.12909 0.993656
C  2.972845 -2.114775 1.151484
C  2.69385 1.558986 -1.180964
C  2.302612 -3.121949 0.414858
C  2.154561 2.556239 -0.331651
C  4.158523 -2.45195 1.852477
C  3.695811 1.923384 -2.11606
C  2.804373 -4.443442 0.385941
C  2.603736 3.894009 -0.420525
C  4.659144 -3.772531 1.828967
C  4.142998 3.25992 -2.209714
C  3.981869 -4.774559 1.094815
C  3.596517 4.251675 -1.361215
H  -3.13384 0.768345 -2.37142
H  -0.23216 1.025792 -1.461741
H  -2.349242 -1.56944 2.303386
H  0.103977 -1.614997 2.005975
H  3.288967 0.023677 1.240415
H  1.901146 -0.528298 2.181374
H  3.065596 -0.570196 -1.287428
H  1.513108 -0.08614 -1.971516
H  -5.934995 1.877252 -1.753611
H  -5.030764 -1.191537 2.155911
H  -2.116198 2.851391 -1.774048
H  -7.834787 1.037403 -0.317266
H  -7.37598 -0.485962 1.611242
H  1.392794 -2.865927 -0.139588
H  1.389494 2.280786 0.402936
H  4.694342 -1.677324 2.416645
H  4.130697 1.157172 -2.77121
H  2.275566 -5.213101 -0.187765
H  2.178055 4.654867 0.243488
H  5.577229 -4.018488 2.374635
H  4.919474 3.526382 -2.935799
H  4.370487 -5.798793 1.072379
H  3.944685 5.288307 -1.429669
