program: Gaussian 09
title: 000227149
version: EM64L-G09RevD.01
frameworkgroup: C1[X(C13H13N3)]
method: RPBEPBE
basis: SDD
operation: Freq
keyword: #pfreq=noraman
keyword: PBEPBE/SDD
title: #p freq=noraman PBEPBE/SDD
converged: NO NO NO NO
title: Mulliken charges:
elementType: N N N C C C C C C C C C C C C C H H H H H H H H H H H H H
charge: -0.717018 -0.719516 -0.712726 -0.702995 0.294889 0.276669 0.316822 0.163180 -0.668569 -0.625164 -0.656283 -0.380295 0.337161 0.358965 0.547090 -0.458465 0.233207 0.233207 0.219572 0.218192 0.226870 0.227220 0.209977 0.305761 0.283653 0.282648 0.305453 0.300510 0.299984
chargesum: 0.00000
title: Mulliken charges with hydrogens summed into heavy atoms:
elementType: N N N C C C C C C C C C C C C C
charge: -0.127604 -0.131416 -0.112232 -0.236581 0.294889 0.276669 0.316822 0.163180 -0.448996 -0.406972 -0.429413 -0.153074 0.337161 0.358965 0.547090 -0.248488
polarizability: 3.13815275e+02 -2.53799341e+00 1.67684457e+02 -5.51911318e-03 -1.74389934e-03 6.90740071e+01
1716.lowfreq: -462.6284 -0.0012 -0.0009 -0.0008 8.2563 12.9115 18.8298 60.8369 97.2462
frequency: -462.6268 60.8138 97.2412 146.6823 149.7321 174.2759 200.3525 246.8484 277.9272 293.1932 298.3092 304.1485 329.0955 330.1999 347.3894 347.5412 404.7855 412.0636 429.9062 436.0812 485.0792 549.3242 556.0734 565.7214 603.9021 649.0277 712.1922 721.7233 725.4573 745.9762 766.5104 808.6011 810.3649 841.0348 855.2771 858.0481 925.9104 929.3832 955.3559 965.3148 1005.9693 1029.7320 1047.3608 1105.4516 1127.1263 1144.3572 1152.4020 1192.5013 1221.3629 1228.7309 1279.0018 1282.8806 1318.7758 1350.2443 1383.4299 1413.5574 1430.8985 1444.5129 1468.3603 1493.5865 1502.8527 1587.3838 1609.2331 1617.5111 1632.3954 1638.0885 1640.6257 1671.3404 2976.8810 3023.0623 3105.6762 3108.2697 3110.3564 3111.2369 3135.9699 3570.6662 3586.0138 3591.2044 3714.2642 3723.9813 3729.2245
redmass: 1.0460 5.1006 4.0715 4.5710 2.4427 1.5769 3.2721 2.3518 1.4095 1.2237 1.1740 4.3360 3.6706 2.3653 3.6839 1.0454 3.9258 3.5514 2.6377 3.1738 4.6278 6.3289 3.1319 3.3079 5.0476 4.0832 6.0327 3.2977 5.6269 2.9085 5.3660 3.6104 1.5056 1.4639 1.7615 1.4944 2.8248 1.4070 2.1924 4.2231 1.6066 1.4507 1.3569 2.6648 1.1385 1.9020 1.4000 1.7110 1.7506 2.2180 1.6690 1.8638 2.4100 4.6899 6.6077 3.2011 1.2541 5.7104 5.0904 4.0081 4.6570 7.1635 7.0292 1.5206 1.6613 2.4617 3.1673 1.1277 1.0596 1.1003 1.0907 1.0906 1.0890 1.0893 1.0964 1.0443 1.0451 1.0456 1.1043 1.1035 1.1017
irintensity: 0.0024 3.9119 0.4943 3.6573 184.3975 221.4339 8.2261 90.9860 135.3983 254.7729 1.9349 1.5287 0.2569 75.4872 2.1507 0.2201 6.1191 2.0916 0.2166 6.4364 0.2405 19.2305 1.2312 0.7229 0.1035 4.1152 0.2034 0.9553 3.6324 0.2732 0.3000 3.8939 53.9336 52.7974 20.4495 1.1365 4.6340 1.2941 16.7453 0.8411 3.5106 2.0895 23.8979 18.6675 0.0152 32.4621 8.4234 1.8750 2.6275 38.4751 56.3197 11.9751 88.7024 52.9296 67.5566 84.1457 13.4526 77.0273 37.6038 305.5531 29.6120 58.4931 99.1313 22.5973 7.5638 214.5141 223.3685 235.3562 33.9894 13.1750 42.5177 23.6216 11.3335 33.3446 29.5064 96.0151 39.7978 74.1014 17.8512 17.9234 7.4328
temp: 298.150 k
press: 1.00000 atm
elementType: 7 7 7 6 6 6 6 6 6 6 6 6 6 6 6 6 1 1 1 1 1 1 1 1 1 1 1 1 1
symmnumber: 1
zpe: 609038.8 jmol-1
zpe.correction: 0.231971 hartree
zpe.thermalcorrener: 0.246127 hartree
zpe.thermalcorrenthalpy: 0.247071 hartree
zpe.thermalcorrgfe: 0.192465 hartree
zpe.sumelectzpe: -666.345238 hartree
zpe.sumelectthermal: -666.331082 hartree
zpe.sumelectthermalent: -666.330138 hartree
zpe.sumelectthermalfe: -666.384744 hartree
dipole: 1.2936 -0.0623 -0.0016
dipole: 1.2951
quadrupole: -48.0994 -76.3555 -103.5850
quadrupole: 3.1403 -0.0494 -0.0077
quadrupole: 27.9139 -0.3422 -27.5717 3.1403 -0.0494 -0.0077
hfenergy: -666.5772089 hartree
pointgroup: C01 [X(C13H13N3)]
dipole: -0.5091436 0.020312 -0.0006485 debye
polarizability: 313.8472741|-1.3282623|167.6524573|0.0055045|0.0017895|69.0740071 unknown
InChI: InChI=1S/C13H13N3/c14-9-1-2-10-7(4-9)3-8-5-12(15)13(16)6-11(8)10/h1-2,4-6H,3,14-16H2
charge 0 multiplicity 1
29 atoms
N  -4.588635 0.906261 0.000112
N  -3.905741 -1.897027 0.000087
N  5.166637 0.087215 0.000041
C  0.410074 1.920971 -0.000004
C  -0.857874 1.066182 -0.000083
C  -0.516698 -0.31792 -0.000107
C  1.522225 0.870267 -0.000008
C  0.951609 -0.441048 -0.000073
C  -2.204033 1.462016 -0.000079
C  -1.534767 -1.29554 -0.000132
C  2.91141 1.060362 0.000087
C  1.804142 -1.568278 -0.000023
C  -3.241398 0.487881 -0.000082
C  -2.900351 -0.907639 -0.0001
C  3.773636 -0.078767 0.000101
C  3.204622 -1.387136 0.000072
H  0.469604 2.575216 0.891959
H  0.46968 2.575322 -0.891886
H  -2.473425 2.526509 -0.00003
H  -1.2852 -2.364596 -0.000128
H  3.339894 2.07116 0.000132
H  1.392878 -2.584804 -0.000047
H  3.868267 -2.261321 0.000108
H  -4.800029 1.898845 -0.000279
H  -5.369396 0.261372 -0.000476
H  -4.895499 -1.683163 -0.00109
H  -3.637541 -2.875704 -0.000689
H  5.577919 1.015164 0.001054
H  5.783192 -0.7190 0.000961
