program: Gaussian 09
title: 000227147
version: EM64L-G09RevD.01
frameworkgroup: C1[X(C25H21F3N2O4)]
method: RPBEPBE
basis: SDD
operation: Freq
keyword: #p
keyword: freq=noraman
keyword: PBEPBE/SDD
title: #p freq=noraman PBEPBE/SDD
converged: YES YES NO NO
title: Mulliken charges:
elementType: F F F O O O O N N C C C C C C C C C C C C C C C C C C C C C C C C C H H H H H H H H H H H H H H H H H H H H H
charge: -0.183799 -0.137898 -0.137494 -0.274598 -0.311300 -0.207836 -0.302641 -0.458599 -0.066619 -0.696526 0.308747 0.294442 0.196168 0.194315 -0.556860 -0.576608 -0.383845 -0.393640 0.537942 0.249531 -0.483811 -0.360799 -0.409773 0.132582 0.544498 -0.562247 -0.548539 0.265828 0.265044 0.048303 0.294174 -0.495490 -0.525646 -0.526912 0.252651 0.253786 0.313183 0.269485 0.244039 0.237266 0.226930 0.242981 0.349835 0.223140 0.252811 0.298692 0.205924 0.248267 0.230702 0.224539 0.250162 0.230220 0.231058 0.268657 0.215576
chargesum: 0.00000
title: Mulliken charges with hydrogens summed into heavy atoms:
elementType: F F F O O O O N N C C C C C C C C C C C C C C C C C C C C C C C C C
charge: -0.183799 -0.137898 -0.137494 -0.274598 -0.311300 -0.207836 -0.302641 -0.108763 -0.066619 -0.190088 0.308747 0.294442 0.196168 0.194315 -0.243676 -0.307123 -0.139806 -0.156374 0.537942 0.249531 -0.256881 -0.117818 -0.186633 0.132582 0.544498 -0.309436 -0.249847 0.265828 0.265044 0.048303 0.294174 0.189404 0.179275 0.188378
polarizability: 8.14261660e+02 -4.74547022e+00 2.84279984e+02 9.24199378e-02 1.90972084e+01 1.70731295e+02
1716.lowfreq: -13.5779 -7.2966 -1.1910 -0.0011 0.0009 0.0016 1.9954 11.4228 17.8125
frequency: -12.9406 11.2402 17.7602 21.6144 26.0872 34.5044 45.9618 59.3277 68.7844 88.7376 92.4679 108.3623 111.4354 123.2539 136.6882 151.7497 160.3638 168.1917 173.4157 185.5734 199.1484 203.0082 214.7098 228.5302 240.8375 249.0910 258.2293 268.9818 281.1853 303.2970 318.9901 334.5009 336.8996 357.4033 384.8932 395.3993 404.9424 424.4635 425.4541 439.0374 446.9778 451.6649 480.4911 488.9992 501.3178 522.5439 546.3863 550.1108 567.4430 596.3135 605.5827 612.1719 629.0102 641.8278 649.6783 669.0611 691.0011 714.4565 721.6494 722.3836 731.5402 755.2233 761.4187 768.5597 788.9614 825.0827 835.7201 841.3000 865.0653 873.8064 884.9112 912.8408 915.8228 923.1470 924.6472 937.1840 937.7563 949.7026 951.0195 973.8498 982.1452 993.7271 1008.6109 1011.9009 1035.6751 1047.1188 1079.7790 1099.5388 1107.4430 1110.6022 1112.4814 1121.5951 1134.6971 1136.3524 1146.9489 1150.1552 1154.5304 1158.1853 1159.4346 1184.6285 1203.7038 1207.2186 1212.5696 1217.0244 1241.7326 1272.9630 1292.6076 1299.3367 1311.0733 1352.3943 1366.8341 1376.1650 1378.6017 1402.2133 1415.2666 1424.7385 1435.4581 1445.0278 1446.1175 1450.1495 1454.7767 1456.7748 1458.1774 1461.5786 1466.8329 1468.1552 1477.7239 1487.5982 1490.6142 1532.2393 1560.6825 1567.8632 1586.1602 1597.1728 1609.7992 1625.8252 1633.0859 1642.4532 2947.5803 2970.1459 2972.8927 2980.5998 2988.0509 3032.9510 3069.4328 3074.8809 3089.8883 3117.0719 3121.1863 3124.2554 3124.8984 3126.9625 3146.8987 3149.2921 3150.4604 3152.9122 3176.8129 3183.1441 3503.9471
redmass: 2.8684 6.8760 6.2858 7.3980 9.0701 7.0348 6.9106 6.2770 6.4280 3.9296 4.4488 5.4587 4.0058 3.8071 4.5568 3.8808 1.2996 2.0317 1.2962 1.9334 4.7663 6.9139 2.8071 3.0144 2.2439 4.2852 4.8147 4.6521 12.1551 4.2624 5.5972 6.6728 4.8781 5.3039 12.4227 8.0340 5.1292 3.0183 4.7631 5.1694 5.1006 5.7652 6.1005 5.4959 10.8620 4.3427 4.5689 4.5366 5.7843 4.5103 5.0752 3.8021 5.8257 4.4534 7.1156 5.5481 5.2344 2.1330 2.0546 3.5637 5.6626 4.1548 4.1273 3.8137 5.2237 1.4971 1.6724 8.0273 4.0686 1.8979 1.5600 1.5155 4.1409 1.6055 3.5294 8.2873 3.5445 1.4190 1.3796 1.9265 1.7928 5.3855 10.7276 4.2234 12.6849 3.7526 4.6399 2.3348 1.2546 1.3073 1.2441 2.1966 1.7390 1.2476 1.4676 1.3569 1.4702 1.6139 1.8068 2.3237 1.6943 1.5114 1.8653 3.3929 2.4156 1.8455 1.5153 2.9974 2.6027 3.3726 4.1820 3.7790 5.1072 2.1020 1.3183 1.1336 1.2994 1.7155 2.4624 3.6081 1.2377 1.2848 1.1716 1.6827 2.4411 1.0875 1.0699 1.0536 4.0704 1.9348 8.1006 6.9509 6.4658 4.8421 7.1009 7.2441 7.4050 8.7890 1.0860 1.0324 1.0310 1.0342 1.0611 1.0992 1.1039 1.1010 1.0973 1.0888 1.1027 1.1039 1.0872 1.1056 1.0962 1.0921 1.0957 1.0932 1.0917 1.0934 1.0764
irintensity: 5.3828 0.0543 0.6876 0.3583 0.1063 0.4664 2.5478 0.8812 0.3654 4.5441 2.4419 2.3008 0.7711 11.5131 1.3422 0.3005 0.1525 3.6031 0.6982 3.1740 5.2810 11.9716 3.3992 8.5739 10.1037 10.9946 4.4996 4.0508 1.5013 25.6117 0.5716 1.9189 2.0937 4.0182 3.2691 3.0490 4.4221 10.9525 4.3536 3.0567 3.2205 2.1880 20.6662 4.2475 8.6814 3.5285 12.8673 6.4296 6.9146 14.9659 9.1515 0.7358 8.7535 9.9979 10.3628 24.2484 0.1090 52.8575 14.1689 1.3159 7.1316 10.8892 4.3047 4.4184 20.2611 102.5594 9.0753 83.5736 8.0343 22.7582 20.8474 19.8986 48.8824 11.5160 5.9168 75.3505 21.5293 0.1512 2.3637 26.5652 26.0969 24.2766 162.2795 108.6809 258.9509 138.6524 348.1364 2.9435 4.2163 37.5482 1.7599 18.2933 19.2458 8.2957 11.5987 2.0130 3.7982 26.3885 91.2790 13.1129 5.7082 39.8841 15.9589 167.8195 26.1231 8.9327 1.6860 327.8674 14.2135 108.1134 180.1882 9.3047 9.6986 65.4781 9.0522 15.5822 37.9532 38.8518 12.8123 58.9971 32.4100 6.0779 16.8565 2.8885 214.1896 18.8212 16.7427 31.8266 31.9548 114.5581 148.0357 20.0048 124.9507 49.7542 69.6057 37.9678 15.1573 451.5775 48.6054 108.4804 78.1128 94.2577 7.6548 4.8808 26.7945 25.4492 45.0886 26.7145 28.4864 23.9120 10.1073 19.7159 10.8559 2.4035 19.4850 1.8270 3.3085 2.6816 61.8573
temp: 298.150 k
press: 1.00000 atm
elementType: 9 9 9 8 8 8 8 7 7 6 6 6 6 6 6 6 6 6 6 6 6 6 6 6 6 6 6 6 6 6 6 6 6 6 1 1 1 1 1 1 1 1 1 1 1 1 1 1 1 1 1 1 1 1 1
symmnumber: 1
zpe: 1068801.6 jmol-1
zpe.correction: 0.407085 hartree
zpe.thermalcorrener: 0.437961 hartree
zpe.thermalcorrenthalpy: 0.438905 hartree
zpe.thermalcorrgfe: 0.341667 hartree
zpe.sumelectzpe: -1672.728887 hartree
zpe.sumelectthermal: -1672.698011 hartree
zpe.sumelectthermalent: -1672.697067 hartree
zpe.sumelectthermalfe: -1672.794305 hartree
dipole: 7.3205 -3.9180 -1.4290
dipole: 8.4251
quadrupole: -181.8603 -188.4007 -194.2896
quadrupole: 23.7928 10.3098 -1.2185
quadrupole: 6.3232 -0.2171 -6.1061 23.7928 10.3098 -1.2185
hfenergy: -1673.1359721 hartree
pointgroup: C01 [X(C25H21F3N2O4)]
dipole: -2.8376385 0.0183347 -1.7130665 debye
polarizability: 812.952295|-21.594709|170.7788487|17.6136283|-17.5597401|285.5417948 unknown
InChI: InChI=1S/C25H21F3N2O4/c1-32-21-8-14(9-22(33-2)23(21)34-3)13-29-17-4-6-19-15(11-17)10-16-12-18(5-7-20(16)19)30-24(31)25(26,27)28/h4-9,11-13,30H,10H2,1-3H3
charge 0 multiplicity 1
55 atoms
F  10.045258 -0.383872 -0.598086
F  10.273783 1.027083 1.17152
F  10.25772 -1.211385 1.510232
O  -6.858317 -0.970423 2.287605
O  -7.886516 1.480538 -1.934105
O  7.668676 0.040258 2.134298
O  -8.869013 0.245015 0.450777
N  7.429888 -0.298955 -0.201663
N  -2.351372 -0.192021 0.057701
C  2.548344 -0.032541 1.351008
C  3.72659 -0.182687 0.396178
C  1.341898 -0.154141 0.426917
C  3.24903 -0.372995 -0.938018
C  1.779726 -0.353904 -0.921322
C  5.097221 -0.151891 0.68894
C  -0.021927 -0.109152 0.737074
C  4.169387 -0.536509 -1.99875
C  0.833269 -0.51377 -1.958997
C  6.014583 -0.315621 -0.386637
C  -0.983083 -0.231393 -0.309372
C  5.548267 -0.506582 -1.717737
C  -0.539982 -0.449825 -1.652079
C  -3.261426 0.322127 -0.73443
C  8.12672 -0.132811 0.973104
C  -4.696472 0.292713 -0.413399
C  -5.618213 0.895466 -1.311786
C  -5.173752 -0.316722 0.771521
C  -6.554701 -0.358847 1.067985
C  -6.990301 0.874397 -1.017923
C  -7.487375 0.230884 0.155576
C  9.669387 -0.174357 0.770641
C  -8.21299 -1.456316 2.601285
C  -8.539329 2.709769 -1.423697
C  -9.728323 -0.486178 -0.513907
H  2.569829 0.939897 1.880364
H  2.551681 -0.815802 2.133827
H  5.467953 -0.007551 1.70575
H  -0.385053 0.024989 1.761005
H  3.82659 -0.684442 -3.028107
H  1.155028 -0.695989 -2.990627
H  6.272093 -0.632003 -2.533289
H  -1.282779 -0.606394 -2.442642
H  7.992775 -0.426844 -1.048866
H  -2.994559 0.83192 -1.685158
H  -5.282765 1.390563 -2.229291
H  -4.464997 -0.775593 1.46595
H  -8.575825 -2.155461 1.824142
H  -8.925007 -0.62368 2.709581
H  -8.089843 -1.993883 3.554335
H  -7.777456 3.482725 -1.208499
H  -9.12563 2.495012 -0.511949
H  -9.199556 3.049763 -2.236036
H  -10.761409 -0.30448 -0.180496
H  -9.575073 -0.102855 -1.537259
H  -9.502852 -1.569441 -0.476091
