program: Gaussian 09
title: 000227144
version: EM64L-G09RevD.01
frameworkgroup: C1[X(C5H6Cl4N2O4)]
method: RPBEPBE
basis: SDD
operation: Freq
keyword: #p
keyword: freq=noraman
keyword: PBEPBE/SDD
title: #p freq=noraman PBEPBE/SDD
converged: NO YES NO NO
title: Mulliken charges:
elementType: Cl Cl Cl Cl O O O O N N C C C C C H H H H H H
charge: 0.152130 0.124418 0.143290 0.157439 -0.151416 -0.133401 -0.130305 -0.157748 0.190300 0.193201 0.483778 -0.502556 -0.524461 -0.683119 -0.700860 0.273637 0.247442 0.250885 0.257474 0.271413 0.238456
chargesum: 0.00000
title: Mulliken charges with hydrogens summed into heavy atoms:
elementType: Cl Cl Cl Cl O O O O N N C C C C C
charge: 0.152130 0.124418 0.143290 0.157439 -0.151416 -0.133401 -0.130305 -0.157748 0.190300 0.193201 0.483778 -0.502556 -0.524461 0.088845 0.066484
polarizability: 1.14791479e+02 -3.13617505e+00 1.26330984e+02 -1.95926589e+00 -2.69146572e+00 1.24798726e+02
1716.lowfreq: -11.0572 0.0001 0.0010 0.0012 2.1826 10.8358 41.8499 68.4358 70.3056
frequency: 41.8341 68.4154 70.3012 96.0532 135.2055 161.0455 166.9517 180.6283 201.4032 226.3810 237.8390 247.6660 260.4460 266.8816 288.8296 294.7308 321.3431 334.6756 350.8197 359.7696 373.0681 391.9583 414.7251 474.5263 503.9088 595.1853 634.5152 678.3550 719.8913 739.2024 751.2537 788.4929 815.5445 846.8693 903.9948 950.7544 958.8682 1033.0589 1136.5822 1161.8261 1172.0489 1189.7882 1194.0787 1394.0107 1416.8149 1444.8053 1453.4716 1469.2380 1473.0989 1487.5592 1491.9598 3020.0690 3023.1775 3119.3556 3129.2092 3132.1514 3141.1186
redmass: 21.0546 14.2284 11.8634 9.3688 16.1090 14.8506 18.6756 13.3647 7.0981 12.9468 4.5239 1.6654 7.6943 12.2243 8.3093 3.5761 2.4665 1.5383 3.0130 5.4282 6.1988 16.9608 7.4332 3.8562 5.7883 13.1488 11.7813 6.9941 6.5532 13.0087 12.1823 8.6082 8.8655 6.0559 3.5505 3.1040 1.6287 1.2663 3.5471 2.1504 3.2523 9.6758 5.1619 1.1823 1.2303 3.0290 5.1329 1.1770 1.1645 1.0469 1.1879 1.0366 1.0349 1.0998 1.1002 1.1014 1.1009
irintensity: 0.2076 0.0192 0.3844 0.8563 1.7904 0.2090 0.3655 0.0864 0.4614 2.4419 0.3219 0.2501 0.4528 0.1161 4.6263 2.1025 1.0892 0.0415 0.8989 0.4406 1.5556 2.6842 7.8689 4.3141 38.2901 8.4095 5.2073 8.7223 18.2651 38.7127 44.5608 56.7633 102.6498 17.7959 58.5210 47.5629 13.9187 0.4099 14.8131 3.9645 84.6463 65.3849 51.4592 54.0278 52.0592 81.6621 83.5320 27.3656 10.4489 19.9731 15.9529 7.2974 6.1108 6.3839 1.0431 4.9255 3.0234
temp: 298.150 k
press: 1.00000 atm
elementType: 17 17 17 17 8 8 8 8 7 7 6 6 6 6 6 1 1 1 1 1 1
symmnumber: 1
zpe: 316626.1 jmol-1
zpe.correction: 0.120597 hartree
zpe.thermalcorrener: 0.137140 hartree
zpe.thermalcorrenthalpy: 0.138084 hartree
zpe.thermalcorrgfe: 0.076560 hartree
zpe.sumelectzpe: -2443.374201 hartree
zpe.sumelectthermal: -2443.357658 hartree
zpe.sumelectthermalent: -2443.356713 hartree
zpe.sumelectthermalfe: -2443.418238 hartree
dipole: -0.3711 -2.7778 -1.0013
dipole: 2.9760
quadrupole: -127.2170 -117.7119 -112.8745
quadrupole: 3.7121 4.5931 1.4429
quadrupole: -7.9492 1.5559 6.3933 3.7121 4.5931 1.4429
hfenergy: -2443.4947975 hartree
pointgroup: C01 [X(C5H6Cl4N2O4)]
dipole: -0.0029314 -1.1682252 0.0780322 debye
dipolederiv: -0.1316643 0.0121051 0.0850712 0.0167456 -0.0903115 -0.0914868 0.0211404 -0.0742549 -0.5754002 -0.3390039 0.185219 -0.1683366 0.1745286 -0.3119581 0.1670328 -0.1367596 0.1776168 -0.2627754 -0.1523852 -0.0384739 -0.1491817 -0.0183362 -0.1633062 -0.1458688 -0.126999 -0.1587443 -0.4932753 -0.1838704 -0.1201891 -0.022729 -0.1679063 -0.5205568 0.0251689 -0.0397169 0.0427778 -0.0917279 -0.2783126 -0.159665 -0.0145364 -0.1183266 -0.4360235 -0.209068 0.1270114 -0.0763765 -0.664334 -0.4460617 0.1152367 0.2140251 0.0237497 -0.5222327 -0.1742914 0.2238682 -0.2673578 -0.3378068 -0.3571394 -0.2225604 0.1606866 -0.281537 -0.4917314 0.1537278 0.1441787 0.0494217 -0.4756623 -0.5724515 -0.2509512 0.1073601 -0.1152666 -0.5595845 -0.0958014 0.1823182 -0.0162662 -0.2475159 0.3813501 0.4698573 -0.1404795 0.502488 0.8941936 0.0947212 -0.24248 0.0467994 0.9097399 0.9396059 0.115316 -0.4330012 0.1015925 0.8197967 0.3041821 -0.5603612 0.3269857 0.3587557 0.0895951 -0.0744263 0.0367426 -0.0730257 -0.1972872 -0.0579791 0.0037988 -0.0712558 -0.2378196 0.7459239 -0.3111642 0.1245495 -0.3048591 0.4122532 -0.119509 0.0554372 -0.098875 1.030656 0.3104853 0.2153001 0.2511073 0.1896288 0.9236611 0.0739654 0.370399 0.0699951 0.8342594 -0.1737127 -0.0432751 -0.0056387 0.0263301 -0.0652212 -0.0169211 0.0025987 0.0757233 -0.002926 -0.1163362 0.0594025 -0.0339578 0.044217 -0.0117037 0.0601666 -0.0295822 -0.004646 -0.0478592 -0.0124227 -0.0483167 0.021215 -0.0501806 0.1343497 -0.0151911 0.0389718 -0.0196388 0.1013927 0.0753607 0.0812531 -0.0769079 0.0461265 0.0301976 0.0446417 -0.0590718 0.0580111 0.0173306 0.1142731 0.0285003 0.0433039 0.0170489 0.0716347 -0.0087879 0.0384716 -0.0647492 -0.042107 0.0436332 0.0518806 -0.0826766 0.0598499 0.0740726 0.0285873 -0.0738494 0.0274211 0.064125 0.1225571 0.0103671 0.0043989 0.0088573 -0.038645 -0.0305475 0.0202528 -0.0030075 0.095985 -0.0594236 -0.0754156 0.0789851 -0.0817246 0.0484026 0.0132583 0.0403732 -0.0195799 0.0669653 unknown
polarizability: 115.9667311|4.4409433|123.7769365|-1.4622253|3.1352815|126.1775223 unknown
InChI: InChI=1S/C5H6Cl4N2O4/c1-3(2,4(6,7)10(12)13)5(8,9)11(14)15/h1-2H3
charge 0 multiplicity 1
21 atoms
Cl 1.720138 -0.740775 -1.905864
Cl 2.532777 -1.699929 0.822519
Cl -1.552194 -0.42866 -2.170053
Cl -0.562152 1.960981 -0.636542
O  2.01796 1.249802 1.529081
O  -2.796396 1.268385 1.002071
O  2.699219 1.598996 -0.612766
O  -3.224544 -0.833991 0.246825
N  2.103924 0.94106 0.293047
N  -2.520067 0.227248 0.331334
C  -0.07937 -0.706869 0.326249
C  1.429996 -0.492321 -0.107886
C  -1.091477 0.200482 -0.48907
C  -0.431476 -2.210815 0.086267
C  -0.27499 -0.396456 1.848074
H  -1.518534 -2.3532 0.186122
H  0.074602 -2.824528 0.847014
H  -0.126715 -2.553058 -0.914777
H  0.557535 -0.828878 2.421967
H  -0.316481 0.680114 2.069115
H  -1.207454 -0.877289 2.188274
