program: Gaussian 09
title: 000227143
version: EM64L-G09RevD.01
frameworkgroup: C1[X(C11H15Cl2NO)]
method: RPBEPBE
basis: SDD
operation: Freq
keyword: #p
keyword: freq=noraman
keyword: PBEPBE/SDD
title: #p freq=noraman PBEPBE/SDD
converged: YES YES NO NO
title: Mulliken charges:
elementType: Cl Cl O N C C C C C C C C C C C H H H H H H H H H H H H H H H
charge: -0.063147 -0.061701 -0.276132 -0.181511 -0.385258 -0.386354 0.491069 -0.508255 -0.585336 -0.585446 -0.391985 0.335411 -0.227753 -0.396449 -0.535531 0.246764 0.249125 0.246402 0.252493 0.255645 0.293927 0.267782 0.297629 0.266187 0.232177 0.220384 0.243638 0.220930 0.220987 0.244307
chargesum: 0.00000
title: Mulliken charges with hydrogens summed into heavy atoms:
elementType: Cl Cl O N C C C C C C C C C C C
charge: -0.063147 -0.061701 -0.276132 -0.181511 0.110630 0.112541 0.491069 -0.252610 -0.023626 -0.021630 -0.159807 0.335411 -0.007369 -0.152811 0.150694
polarizability: 2.09707560e+02 1.94081468e+00 1.70002158e+02 6.61290429e+00 -1.53928617e+01 8.81770432e+01
1716.lowfreq: -8.3985 -4.7973 0.0020 0.0023 0.0027 4.3020 27.5441 38.2527 42.7244
frequency: 27.4959 38.2392 42.6587 49.8465 88.4782 110.0826 126.4722 176.8088 193.6633 203.6446 207.9158 219.8497 239.5662 261.1180 295.0517 343.9272 387.2291 438.8676 461.8385 528.3049 550.1447 561.3079 611.3089 664.0123 683.2667 694.9881 704.3306 756.6441 783.2396 789.2049 831.6410 840.9591 851.7597 952.4984 958.4594 978.2624 999.3062 1014.9203 1033.5091 1035.5043 1050.2617 1100.0509 1111.9630 1121.1460 1146.7615 1165.5735 1189.5061 1217.2702 1226.6248 1252.1046 1256.9921 1280.5522 1291.3115 1311.4198 1350.9773 1355.5805 1379.8984 1392.3984 1434.3984 1454.3505 1458.3371 1460.3887 1465.5355 1475.2961 1485.3938 1491.6987 1506.0741 1578.1287 1625.7614 2959.5930 3013.4755 3019.2856 3047.1346 3063.2488 3064.3391 3070.7330 3076.0347 3125.4545 3132.7696 3148.9907 3150.3625 3165.8261 3173.0984 3178.7520
redmass: 8.8738 7.3595 7.4279 5.3627 3.1622 2.5933 2.4777 3.6312 2.2254 4.4236 4.4936 3.3545 4.2310 2.0085 3.1563 4.0836 3.2430 4.2908 3.4943 4.7912 3.7908 4.4459 4.6431 7.0818 2.0760 3.8156 5.1411 1.5334 1.1241 1.1386 1.4640 4.8365 1.6989 1.3667 2.9792 5.0487 1.4248 2.7459 4.0885 3.8241 1.6829 1.7155 1.2593 1.3800 1.4820 1.4629 1.1778 1.8718 2.5424 1.1629 1.1715 1.4056 1.1958 1.3932 1.2654 1.4234 1.7350 6.6947 1.2664 1.6206 1.0949 1.3762 1.0503 1.1019 1.1213 2.5045 1.1465 5.9286 6.6593 1.0330 1.0600 1.0605 1.1039 1.0580 1.0594 1.1010 1.1035 1.0993 1.0873 1.1121 1.1117 1.0916 1.0906 1.0961
irintensity: 0.6485 0.5008 0.4566 0.1709 9.1733 2.1408 2.1869 2.2015 0.7408 1.6334 2.0634 0.8904 16.0158 0.6968 1.5759 12.8736 2.4207 4.8889 1.2429 3.0192 7.5495 28.1827 0.5874 56.0854 56.2586 57.4845 16.1758 52.6665 4.6910 14.6905 0.4754 6.3561 43.2497 0.2620 0.4111 5.4923 6.0376 74.4379 0.6042 0.8224 21.3641 6.3814 0.2420 43.9731 96.8116 109.9410 4.9708 14.8982 108.8748 13.3170 19.4078 11.1044 11.4035 5.6918 3.2013 35.8557 20.8129 27.5384 5.4618 2.8281 9.2411 17.8046 12.9535 31.4359 25.3462 170.6821 40.9868 88.7599 371.8915 72.1669 25.0412 14.3607 48.9774 12.4524 15.0098 13.4081 9.7263 25.4355 11.5371 8.9799 13.7252 21.6533 11.0897 4.0263
temp: 298.150 k
press: 1.00000 atm
elementType: 17 17 8 7 6 6 6 6 6 6 6 6 6 6 6 1 1 1 1 1 1 1 1 1 1 1 1 1 1 1
symmnumber: 1
zpe: 632592.3 jmol-1
zpe.correction: 0.240942 hartree
zpe.thermalcorrener: 0.257046 hartree
zpe.thermalcorrenthalpy: 0.257990 hartree
zpe.thermalcorrgfe: 0.194675 hartree
zpe.sumelectzpe: -1477.096587 hartree
zpe.sumelectthermal: -1477.080482 hartree
zpe.sumelectthermalent: -1477.079538 hartree
zpe.sumelectthermalfe: -1477.142854 hartree
dipole: -2.2132 -1.6859 0.2927
dipole: 2.7975
quadrupole: -98.2316 -115.0588 -104.4803
quadrupole: 10.8566 0.1058 -0.5325
quadrupole: 7.6919 -9.1352 1.4433 10.8566 0.1058 -0.5325
hfenergy: -1477.3375283 hartree
pointgroup: C01 [X(C11H15Cl2N1O1)]
dipole: -0.9642526 -0.5172234 0.1186081 debye
polarizability: 209.3625353|-4.5060746|170.5682931|3.2746363|-15.7725169|87.9559331 unknown
InChI: InChI=1S/C11H15Cl2NO/c1-15-11-4-2-3-10(9-11)14(7-5-12)8-6-13/h2-4,9H,5-8H2,1H3
charge 0 multiplicity 1
30 atoms
Cl 4.455324 -2.578628 -0.237846
Cl 1.800054 4.290974 0.031489
O  -3.414212 0.865074 -0.440012
N  1.347008 0.163637 0.014939
C  2.515998 -0.646618 0.393263
C  1.602408 1.53301 -0.461201
C  0.031726 -0.351704 0.107043
C  -1.093296 0.461743 -0.198911
C  2.968489 -1.539865 -0.77872
C  1.467415 2.548885 0.690104
C  -0.205507 -1.705012 0.511052
C  -2.40512 -0.05646 -0.108925
C  -1.520403 -2.1950 0.598819
C  -2.642981 -1.393109 0.293234
C  -4.802175 0.405302 -0.356584
H  3.346915 0.023414 0.676272
H  2.297075 -1.269807 1.277979
H  2.624893 1.590588 -0.874305
H  0.913169 1.800077 -1.281501
H  -0.997271 1.506204 -0.505486
H  2.193294 -2.257034 -1.083258
H  3.312481 -0.952141 -1.642681
H  0.452701 2.573133 1.111548
H  2.211804 2.381514 1.48271
H  0.622364 -2.376686 0.751829
H  -1.676299 -3.234396 0.909718
H  -3.652931 -1.802901 0.369041
H  -5.063148 0.096648 0.674551
H  -4.991355 -0.434668 -1.053058
H  -5.409618 1.274125 -0.649201
