program: Gaussian 09
title: 000227139
version: EM64L-G09RevD.01
frameworkgroup: C1[X(C17H16ClNO2)]
method: RPBEPBE
basis: SDD
operation: Freq
keyword: #p
keyword: freq=noraman
keyword: PBEPBE/SDD
title: #p freq=noraman PBEPBE/SDD
converged: YES YES NO NO
title: Mulliken charges:
elementType: Cl O O N C C C C C C C C C C C C C C C C C H H H H H H H H H H H H H H H H
charge: -0.064717 -0.292578 -0.258549 -0.503739 0.416562 0.261164 0.567193 -0.343997 -0.407338 -0.517078 -0.361894 -0.347447 -0.232172 -0.232083 -0.230421 -0.213732 -0.225837 -0.245252 0.201637 -0.217448 -0.675979 0.325346 0.256219 0.256655 0.274538 0.284735 0.230906 0.229378 0.231348 0.256107 0.234156 0.237885 0.220672 0.223856 0.207377 0.226291 0.228235
chargesum: 0.00000
title: Mulliken charges with hydrogens summed into heavy atoms:
elementType: Cl O O N C C C C C C C C C C C C C C C C C
charge: -0.064717 -0.292578 -0.258549 -0.178393 0.416562 0.261164 0.567193 -0.087779 -0.150683 -0.242540 -0.361894 -0.062712 -0.001266 -0.002705 0.000927 0.042375 0.008320 -0.007367 0.201637 0.227080 -0.014077
polarizability: 2.87085315e+02 1.66725831e+01 2.72253983e+02 -1.04258660e+01 -9.15867299e+00 1.29644698e+02
1716.lowfreq: -4.3087 -0.0013 0.0006 0.0010 4.3033 6.6515 24.3900 25.1333 38.9333
frequency: 24.3875 25.0287 38.9239 44.6259 52.6444 59.5253 80.7683 111.1911 125.0204 155.0948 159.2962 199.1635 216.8705 230.2904 249.3487 275.2977 298.2718 306.2796 359.5507 370.3230 394.5937 406.2123 439.0234 452.6104 521.1963 536.5103 574.3387 603.9583 613.6536 640.4943 659.1820 682.7824 688.0897 700.2122 709.2208 722.3999 753.7191 768.9456 786.9711 798.0241 825.2628 844.1391 850.8661 854.6338 889.3446 930.6550 944.0676 973.5649 976.8022 984.0433 989.9191 997.7263 1009.5308 1023.8055 1033.8598 1040.6563 1071.5448 1085.7340 1112.3015 1124.5617 1135.4843 1145.3048 1174.1140 1174.6173 1191.8640 1225.2008 1246.1531 1272.5433 1319.3689 1325.4929 1341.8143 1360.8401 1380.9013 1384.5641 1399.4227 1433.2812 1434.6930 1463.0372 1463.4502 1474.0178 1484.1380 1487.7863 1515.5821 1577.9261 1584.4985 1602.3913 1609.8485 1613.6772 1623.5708 2993.2811 3001.9693 3057.7849 3089.7236 3103.4885 3125.7274 3134.6678 3143.3464 3148.1017 3159.1806 3162.2977 3167.5752 3176.0293 3177.6444 3183.9207 3477.4227
redmass: 7.1938 3.4112 4.2266 4.8490 5.1779 3.2950 4.6015 3.4829 4.7573 4.1213 6.7715 5.4248 5.3505 2.3754 2.0759 3.2831 5.5400 6.5853 4.9437 4.3873 8.0923 2.8562 3.3358 4.0481 4.1139 4.3370 4.9501 3.2567 6.0090 2.1037 4.0847 3.1475 5.6722 1.7984 4.4864 5.8931 1.2589 2.1363 5.0901 1.1000 4.1120 1.5147 1.2427 3.4155 1.3547 1.4310 1.3493 4.6381 1.4005 1.3318 5.2964 1.3694 6.9773 2.5697 2.3866 2.3719 3.3699 1.5981 2.2356 1.8795 1.4680 1.8709 1.0818 1.0532 1.1142 1.9828 1.1360 1.9860 1.3356 2.2017 1.5573 2.0326 8.1744 3.1552 1.2833 2.5428 2.2508 1.0413 2.3070 1.0608 2.2579 1.0972 2.1385 5.2365 4.9434 8.2675 7.3824 7.0717 5.1098 1.0360 1.0577 1.1063 1.0985 1.1020 1.0856 1.0884 1.0863 1.0932 1.0907 1.0979 1.0898 1.0950 1.0982 1.0982 1.0753
irintensity: 0.2545 0.6223 0.5335 0.8174 0.2327 1.3772 0.4142 3.1916 2.0048 2.1670 1.0606 1.6789 1.7959 0.9401 0.8307 1.6205 2.1930 14.0678 4.7837 2.0663 7.3992 0.1504 12.2105 4.3902 11.9875 3.7195 18.1285 22.9056 1.4365 55.0146 19.9350 31.5098 5.1215 46.7272 4.2872 4.9635 112.0286 23.1097 8.3302 3.9918 7.7618 21.7965 2.5928 1.2870 20.2490 3.1206 3.7767 155.9778 2.9815 2.1957 1.1172 0.0346 59.4137 1.8676 88.3105 89.5761 399.2601 5.4503 3.5987 57.5232 4.7101 59.9779 0.4702 0.1319 5.3630 17.3832 0.0243 30.9823 0.9728 96.6906 11.5482 38.7456 0.9946 84.9165 23.0880 81.9590 5.9263 12.2705 35.9944 10.7183 22.4966 3.3604 535.6768 36.2985 17.0585 484.7507 61.0234 26.8353 214.7104 28.4341 28.6828 12.2364 36.5056 45.7626 2.4256 3.3294 2.6786 25.0808 9.5339 33.7518 7.5264 7.3892 7.4933 6.8491 55.6568
temp: 298.150 k
press: 1.00000 atm
elementType: 17 8 8 7 6 6 6 6 6 6 6 6 6 6 6 6 6 6 6 6 6 1 1 1 1 1 1 1 1 1 1 1 1 1 1 1 1
symmnumber: 1
zpe: 754513.5 jmol-1
zpe.correction: 0.287379 hartree
zpe.thermalcorrener: 0.307180 hartree
zpe.thermalcorrenthalpy: 0.308124 hartree
zpe.thermalcorrgfe: 0.236003 hartree
zpe.sumelectzpe: -1321.170147 hartree
zpe.sumelectthermal: -1321.150347 hartree
zpe.sumelectthermalent: -1321.149402 hartree
zpe.sumelectthermalfe: -1321.221524 hartree
dipole: -1.5948 -0.7071 0.4117
dipole: 1.7925
quadrupole: -122.8031 -111.5384 -130.1511
quadrupole: 2.4901 -7.5496 -2.0538
quadrupole: -1.3055 9.9591 -8.6536 2.4901 -7.5496 -2.0538
hfenergy: -1321.4575263 hartree
pointgroup: C01 [X(C17H16Cl1N1O2)]
dipole: -0.6773821 0.0974327 -0.170266 debye
polarizability: 294.4055324|-10.4921337|264.7162007|15.0110784|-1.5395519|129.8622627 unknown
InChI: InChI=1S/C17H16ClNO2/c1-2-21-17(20)12-16(13-8-4-3-5-9-13)19-15-11-7-6-10-14(15)18/h3-12,19H,2H2,1H3
charge 0 multiplicity 1
37 atoms
Cl -3.477654 -2.234154 1.025306
O  1.854598 2.923991 0.389421
O  3.059023 1.041657 -0.303601
N  -1.042896 -0.807356 -0.057439
C  0.299393 -0.386528 -0.02119
C  1.250526 -1.527385 -0.188769
C  -2.225797 -0.064333 -0.256636
C  2.382708 -1.667235 0.65499
C  0.992028 -2.526595 -1.166988
C  0.639417 0.93805 0.202286
C  -3.470582 -0.606286 0.174485
C  -2.274516 1.178602 -0.951743
C  3.235805 -2.780866 0.523751
C  1.853305 -3.636993 -1.303712
C  2.976318 -3.768976 -0.455663
C  -4.698411 0.039697 -0.036746
C  -3.499606 1.839376 -1.166766
C  -4.716033 1.284169 -0.706665
C  1.962132 1.545959 0.060524
C  3.118392 3.70329 0.292077
C  2.780272 5.140681 0.678177
H  -1.194025 -1.795514 0.172112
H  2.588917 -0.904925 1.411022
H  0.135004 -2.414755 -1.841401
H  -0.144914 1.645077 0.483386
H  -1.34895 1.60861 -1.34113
H  4.10513 -2.87774 1.182784
H  1.651188 -4.391793 -2.071465
H  3.644402 -4.631424 -0.557708
H  -5.62337 -0.421769 0.320589
H  -3.501828 2.792968 -1.704951
H  -5.66601 1.802568 -0.867789
H  3.867017 3.250664 0.968595
H  3.505987 3.62334 -0.740325
H  3.688505 5.768821 0.626349
H  2.02489 5.564507 -0.00582
H  2.382134 5.188403 1.706352
