program: Gaussian 09
title: 000227137
version: EM64L-G09RevD.01
frameworkgroup: C1[X(C11H15Cl2NO)]
method: RPBEPBE
basis: SDD
operation: Freq
keyword: #p
keyword: freq=noraman
keyword: PBEPBE/SDD
title: #p freq=noraman PBEPBE/SDD
converged: YES YES NO NO
title: Mulliken charges:
elementType: Cl Cl O N C C C C C C C C C C C H H H H H H H H H H H H H H H
charge: -0.059734 -0.062132 -0.309879 -0.201431 -0.406927 -0.350367 0.321817 0.185199 -0.589848 -0.590975 -0.340407 -0.334990 -0.257381 -0.236793 -0.530916 0.252310 0.256330 0.290604 0.226786 0.277162 0.270795 0.261803 0.292160 0.232219 0.249620 0.227321 0.231860 0.230678 0.226966 0.238151
chargesum: 0.00000
title: Mulliken charges with hydrogens summed into heavy atoms:
elementType: Cl Cl O N C C C C C C C C C C C
charge: -0.059734 -0.062132 -0.309879 -0.201431 0.101713 0.167023 0.321817 0.185199 -0.041892 -0.037012 -0.108188 -0.085370 -0.030060 -0.004933 0.164878
polarizability: 1.79775602e+02 3.38732511e+00 1.63725057e+02 9.78654444e+00 2.18797631e+01 1.09550061e+02
1716.lowfreq: -10.5765 -7.1837 -4.5790 -0.0010 -0.0007 0.0017 8.6253 38.8535 39.9737
frequency: 6.2056 38.7542 39.9712 55.3313 81.1379 89.3385 111.3603 135.8461 157.9841 180.4679 205.7406 212.4046 237.3357 259.8934 322.5398 359.1186 385.8110 405.8000 472.2843 493.7289 559.3055 563.0358 575.4259 669.2897 678.5313 706.1954 738.3397 755.8038 774.7374 780.5890 792.4547 846.3912 932.9959 943.9264 952.8448 970.4869 997.9616 1024.9440 1029.5703 1039.9090 1050.6236 1087.0371 1112.3128 1118.0332 1148.4028 1161.9876 1172.8878 1190.1692 1207.0606 1244.4648 1256.1013 1265.8708 1281.1742 1309.1894 1353.7855 1360.0507 1368.3765 1381.3915 1422.1090 1439.0211 1452.3052 1455.3579 1457.5846 1464.5321 1474.7463 1476.3184 1488.0829 1571.2654 1606.8115 2961.3758 2996.9601 3024.7815 3051.8904 3055.0928 3059.1149 3071.8384 3092.8230 3115.9111 3131.1529 3141.2399 3144.5617 3146.4418 3154.3950 3171.4656
redmass: 4.3283 5.5965 9.9077 6.7829 2.9194 3.0386 2.8276 2.7355 1.1423 3.2437 8.6427 4.2122 5.7269 3.2377 3.8537 3.1538 5.2535 5.3479 3.9377 3.7958 4.6950 4.7795 3.8502 6.7158 5.3316 4.1516 3.3240 1.2869 1.2308 1.5794 2.3350 1.4832 1.5073 4.0409 4.1803 1.3143 1.5106 3.1911 1.9981 3.9116 1.7358 2.4061 1.2542 1.5010 1.3428 1.3944 1.2915 2.0150 2.0960 1.2192 1.1730 1.5009 1.3231 1.3259 1.4108 2.1760 1.9187 1.5261 1.3604 1.5909 1.1311 1.0920 1.0674 1.1259 1.1535 1.0820 2.4636 6.6276 6.5399 1.0309 1.0639 1.0607 1.1042 1.0577 1.0570 1.0985 1.1024 1.1015 1.0852 1.1102 1.0905 1.1115 1.0945 1.1008
irintensity: 0.5879 0.3747 1.9629 0.2850 0.5153 4.8304 1.2832 0.3448 0.1245 4.6683 4.3842 6.5283 1.6504 8.7506 10.5613 4.0479 8.8526 8.3497 7.5188 8.3274 15.6707 1.0801 4.4798 36.1903 70.8045 28.9158 2.1882 92.9916 8.1503 13.7831 8.7943 0.2593 3.4267 40.2800 34.6635 0.7115 3.9022 2.5602 5.0955 0.9459 16.5583 29.8440 4.0839 45.8882 0.3388 24.6737 11.5104 55.2674 46.9447 21.5533 4.5969 11.3768 25.2701 16.4658 12.8458 17.8017 4.8269 11.8042 4.0364 14.5300 8.4161 12.9382 3.4735 20.9779 18.3869 4.7284 191.8190 2.4577 59.7665 55.0230 24.6613 30.0830 41.3785 14.6803 23.1610 10.7625 3.7431 22.7305 5.7406 15.0970 5.9583 14.3636 27.0360 15.8113
temp: 298.150 k
press: 1.00000 atm
elementType: 17 17 8 7 6 6 6 6 6 6 6 6 6 6 6 1 1 1 1 1 1 1 1 1 1 1 1 1 1 1
symmnumber: 1
zpe: 629713.6 jmol-1
zpe.correction: 0.239845 hartree
zpe.thermalcorrener: 0.256262 hartree
zpe.thermalcorrenthalpy: 0.257207 hartree
zpe.thermalcorrgfe: 0.191812 hartree
zpe.sumelectzpe: -1477.084101 hartree
zpe.sumelectthermal: -1477.067684 hartree
zpe.sumelectthermalent: -1477.066739 hartree
zpe.sumelectthermalfe: -1477.132134 hartree
dipole: -1.1857 -1.9212 1.2284
dipole: 2.5702
quadrupole: -110.5777 -114.6449 -98.3409
quadrupole: 6.4441 -3.4008 6.6412
quadrupole: -2.7231 -6.7904 9.5136 6.4441 -3.4008 6.6412
hfenergy: -1477.323946 hartree
pointgroup: C01 [X(C11H15Cl2N1O1)]
dipole: -0.6303306 0.6521791 -0.4470873 debye
polarizability: 182.2019005|1.7653258|157.3992591|-10.3392975|24.8538654|113.4495608 unknown
InChI: InChI=1S/C11H15Cl2NO/c1-15-11-5-3-2-4-10(11)14(8-6-12)9-7-13/h2-5H,6-9H2,1H3
charge 0 multiplicity 1
30 atoms
Cl 4.02213 2.602392 0.331106
Cl 1.936543 -3.769461 0.540643
O  -1.632488 -1.388912 -1.242143
N  0.781776 0.09786 -0.488033
C  1.827781 1.129836 -0.612128
C  1.212649 -1.316095 -0.605279
C  -0.50174 0.440503 0.023969
C  -1.678974 -0.304585 -0.320275
C  2.788684 1.190022 0.594821
C  1.310319 -1.999438 0.772072
C  -0.681572 1.562768 0.886449
C  -2.931121 0.005276 0.247589
C  -1.944863 1.89539 1.416833
C  -3.077468 1.102572 1.123483
C  -1.527582 -0.950768 -2.650867
H  2.424675 0.930737 -1.522871
H  1.349108 2.114693 -0.748698
H  0.504152 -1.893818 -1.21949
H  2.200514 -1.332994 -1.098972
H  2.275775 1.410873 1.542392
H  3.4074 0.285452 0.69173
H  2.03147 -1.51624 1.448008
H  0.326671 -2.093858 1.254379
H  0.182467 2.172514 1.169595
H  -3.785271 -0.618697 -0.036513
H  -2.035666 2.763567 2.078818
H  -4.055202 1.341512 1.553569
H  -0.613596 -0.346933 -2.813425
H  -2.41724 -0.356958 -2.934058
H  -1.485631 -1.874409 -3.248403
