program: Gaussian 09
title: 000227135
version: EM64L-G09RevD.01
frameworkgroup: C1[X(C8H16N2S4)]
method: RPBEPBE
basis: SDD
operation: Freq
keyword: #p
keyword: freq=noraman
keyword: PBEPBE/SDD
title: #p freq=noraman PBEPBE/SDD
converged: NO YES NO NO
title: Mulliken charges:
elementType: S S S S N N C C C C C C C C H H H H H H H H H H H H H H H H
charge: 0.176555 0.176217 0.134429 0.134397 -0.405291 -0.405804 -0.282501 -0.270440 -0.282795 -0.270154 -0.651918 -0.661930 -0.651044 -0.661572 0.229265 0.238695 0.234343 0.220507 0.229012 0.238777 0.234454 0.219894 0.266450 0.253095 0.251562 0.267214 0.266575 0.253097 0.251620 0.267292
chargesum: 0.00000
title: Mulliken charges with hydrogens summed into heavy atoms:
elementType: S S S S N N C C C C C C C C
charge: 0.176555 0.176217 0.134429 0.134397 -0.405291 -0.405804 0.185459 0.184410 0.184994 0.184194 -0.132373 -0.143154 -0.131372 -0.142661
polarizability: 2.52719620e+02 -3.38795484e-01 1.64616215e+02 -1.36201290e+00 9.77710775e-02 1.35809458e+02
1716.lowfreq: -10.6700 -3.2909 -0.0018 0.0022 0.0024 5.4843 24.0885 34.7225 41.0340
frequency: 24.0335 34.5863 41.0138 61.6368 68.9583 107.5472 144.6445 209.6425 210.3042 218.3640 230.5597 278.4627 289.1491 290.6652 315.3081 337.5895 370.6658 373.0818 408.3576 410.7750 487.8122 489.3465 612.9519 614.1854 630.9933 636.9895 638.1346 638.6523 795.4116 796.4348 877.5534 892.2660 958.8331 959.8703 964.0035 965.2106 990.9459 992.6906 1038.4290 1040.3024 1041.8453 1042.4747 1125.8520 1126.4086 1157.7299 1160.6010 1203.2557 1204.2971 1231.9333 1233.0701 1261.3375 1262.9577 1274.0460 1276.2506 1311.9989 1313.7347 1327.7693 1333.7476 1345.2225 1354.8261 1422.6152 1422.7970 1430.4281 1430.9873 1444.6464 1445.7977 1454.4904 1454.9419 2914.6967 2918.9365 2939.8466 2941.3777 3025.5426 3025.7965 3027.8707 3028.1065 3049.0078 3050.0869 3054.4004 3055.7176 3106.4779 3106.7624 3107.6947 3108.0396
redmass: 7.1663 4.7997 5.1277 4.5282 4.3494 4.8241 4.9258 2.4060 2.3493 3.0194 3.7888 7.9662 4.9347 6.7338 3.3400 4.1809 2.4777 2.4657 2.9996 3.0355 3.8819 3.8867 4.9459 5.1826 2.6922 2.6389 4.9139 4.8969 1.5498 1.5449 3.3402 3.2828 2.0639 2.1072 1.6128 1.5864 2.0884 2.0688 2.1366 2.1090 2.2038 2.0862 2.9378 2.9201 1.1537 1.1600 1.2112 1.2115 1.7122 1.7119 1.3689 1.3674 1.1830 1.1850 1.1629 1.1657 1.2557 1.2451 1.3268 1.3281 1.0887 1.0886 1.0893 1.0892 1.0776 1.0779 1.0832 1.0833 1.0674 1.0670 1.0668 1.0668 1.0601 1.0600 1.0599 1.0596 1.0898 1.0902 1.0930 1.0932 1.1072 1.1072 1.1067 1.1068
irintensity: 0.0005 0.0691 0.0012 0.1577 0.0272 0.5157 12.3957 3.3235 1.2800 1.7428 31.2799 0.3061 1.2001 0.3277 1.1056 0.0039 10.0598 24.0125 0.7555 0.4491 0.3561 0.1291 28.9860 5.9781 47.2296 0.4412 1.2588 1.2614 0.5995 0.2962 200.7425 23.3502 20.4302 27.3715 19.2658 1.9792 0.3643 0.2328 27.1577 2.8199 0.6961 1.1963 4.0379 4.2217 0.8211 0.2782 3.9482 2.0681 9.5983 7.4999 13.8462 0.8966 37.4720 25.0436 10.4160 3.9865 2.5665 0.2261 50.3649 3.8312 5.9711 5.0476 30.0028 17.3127 6.1393 11.5414 30.2541 40.1729 10.3239 35.0514 46.3293 12.3394 38.1839 15.2826 17.6649 19.0752 9.4515 34.5050 18.7189 17.9559 14.1938 12.4616 6.5271 6.1175
temp: 298.150 k
press: 1.00000 atm
elementType: 16 16 16 16 7 7 6 6 6 6 6 6 6 6 1 1 1 1 1 1 1 1 1 1 1 1 1 1 1 1
symmnumber: 1
zpe: 628056.1 jmol-1
zpe.correction: 0.239214 hartree
zpe.thermalcorrener: 0.255430 hartree
zpe.thermalcorrenthalpy: 0.256375 hartree
zpe.thermalcorrgfe: 0.193015 hartree
zpe.sumelectzpe: -2015.037526 hartree
zpe.sumelectthermal: -2015.021309 hartree
zpe.sumelectthermalent: -2015.020365 hartree
zpe.sumelectthermalfe: -2015.083725 hartree
dipole: -0.0173 -0.3259 0.0160
dipole: 0.3268
quadrupole: -118.1593 -120.4406 -113.4988
quadrupole: 0.0285 0.3757 -0.0170
quadrupole: -0.7930 -3.0744 3.8674 0.0285 0.3757 -0.0170
hfenergy: -2015.2767397 hartree
pointgroup: C01 [X(C8H16N2S4)]
dipole: 0.010132 0.1274541 -0.0134223 debye
polarizability: 252.3543888|-3.2333426|164.0535884|-5.6868899|-4.1755745|136.7373156 unknown
InChI: InChI=1S/2C4H8NS2/c2*6-5-1-3-7-4-2-5/h2*1-4H2
charge 0 multiplicity 1
30 atoms
S  4.178941 1.365741 -0.903549
S  -4.162263 1.730768 0.354463
S  0.841366 -1.777862 1.07836
S  -0.949961 -1.972838 -0.604931
N  2.096803 -0.693954 0.486696
N  -2.151494 -0.71012 -0.351839
C  2.860908 -1.151449 -0.702829
C  1.818121 0.760452 0.565186
C  -2.928188 -0.77394 0.912983
C  -1.816523 0.648379 -0.842474
C  4.260844 -0.518485 -0.762558
C  3.112011 1.587633 0.641052
C  -4.306939 -0.108923 0.770598
C  -3.080254 1.461112 -1.172426
H  2.301416 -0.9182 -1.636085
H  2.954449 -2.249553 -0.626662
H  1.217483 0.929843 1.476892
H  1.218764 1.09282 -0.313995
H  -2.361376 -0.291523 1.740078
H  -3.055812 -1.842152 1.163471
H  -1.207811 0.526156 -1.756306
H  -1.207703 1.2003 -0.088759
H  4.843091 -0.772838 0.139031
H  4.800922 -0.866138 -1.658716
H  2.877661 2.66371 0.696334
H  3.709695 1.296611 1.52118
H  -4.896382 -0.598531 -0.02268
H  -4.858556 -0.160737 1.723856
H  -2.808107 2.467325 -1.532158
H  -3.683203 0.946991 -1.939616
