program: Gaussian 09
title: 000227134
version: EM64L-G09RevD.01
frameworkgroup: C1[X(C12H17Cl2NO)]
method: RPBEPBE
basis: SDD
operation: Freq
keyword: #p
keyword: freq=noraman
keyword: PBEPBE/SDD
title: #p freq=noraman PBEPBE/SDD
converged: YES YES NO NO
title: Mulliken charges:
elementType: Cl Cl O N C C C C C C C C C C C C H H H H H H H H H H H H H H H H H
charge: -0.079551 -0.078489 -0.291615 -0.234620 0.337187 -0.354425 -0.363832 0.236913 -0.356737 -0.560941 -0.568556 -0.340988 -0.247300 -0.256864 -0.243342 -0.685549 0.232468 0.240566 0.223921 0.288910 0.230936 0.274945 0.266144 0.273997 0.259217 0.244666 0.227259 0.227473 0.212102 0.210604 0.211864 0.231903 0.231730
chargesum: 0.00000
title: Mulliken charges with hydrogens summed into heavy atoms:
elementType: Cl Cl O N C C C C C C C C C C C C
charge: -0.079551 -0.078489 -0.291615 -0.234620 0.337187 0.118609 0.148999 0.236913 -0.125800 -0.019852 -0.035342 -0.096321 -0.020041 -0.029390 0.179363 -0.010051
polarizability: 1.84176553e+02 -1.14422232e+01 1.70110618e+02 3.23581420e+00 2.67143721e+01 1.46391347e+02
1716.lowfreq: -11.4911 0.0026 0.0027 0.0030 4.6171 5.3221 20.9699 24.8370 33.7120
frequency: 20.7006 24.8267 33.6930 43.3194 74.7378 78.3683 94.8504 113.0213 126.6798 148.2887 205.6290 207.5096 210.0354 243.8002 251.4036 284.5827 316.0308 341.5152 374.0013 427.4104 475.7048 524.8015 534.2274 565.0246 595.2867 652.3682 669.4904 720.5016 730.7851 749.0059 771.0750 778.7929 781.8358 825.4116 846.1315 901.1707 919.9121 949.4616 964.6752 995.1934 1027.9365 1034.0356 1039.2148 1042.2611 1050.3837 1103.7058 1109.5330 1118.2150 1135.9794 1168.6504 1175.0935 1208.8024 1216.3469 1245.7240 1248.8556 1262.8867 1266.2674 1283.8689 1298.0362 1342.1702 1354.9014 1361.0185 1367.9773 1380.7760 1401.6316 1434.9714 1448.7152 1451.2489 1462.9172 1469.3162 1477.2462 1483.4903 1492.1279 1499.8172 1582.4409 1598.3269 2958.1954 2996.9643 3011.7820 3017.0685 3019.6218 3054.3654 3063.6182 3079.7046 3094.1814 3098.0943 3105.3509 3129.4253 3140.9162 3143.0494 3152.2915 3156.2031 3171.1667
redmass: 5.2551 7.9463 6.5917 5.9350 3.7257 2.4917 2.3609 1.8257 3.3857 3.6682 4.8611 4.3780 8.4977 1.6830 2.0313 5.1275 3.3452 4.0960 2.9287 5.1070 3.8677 4.3114 4.1482 4.0515 5.9786 6.8219 5.5719 4.0439 3.4153 1.2651 1.1996 1.9388 1.7221 1.1728 1.3415 3.3513 1.3772 3.0921 1.3138 1.4222 1.5970 2.5917 4.6051 4.0108 2.0434 2.0974 1.5701 1.9923 1.4365 1.4839 1.1561 2.2649 2.6948 1.1564 1.1558 1.1537 1.4427 1.3182 1.3610 1.2619 1.3522 1.8877 1.7012 2.5457 1.2910 2.3289 1.0898 1.0945 1.0400 1.0915 1.1174 1.2899 1.0978 1.7958 6.9135 6.1434 1.0555 1.0363 1.0626 1.1074 1.0636 1.0566 1.0566 1.1020 1.0989 1.1000 1.1015 1.0853 1.0892 1.1120 1.1126 1.0936 1.0998
irintensity: 0.4521 0.3338 0.5029 0.4094 1.3298 0.5592 2.5631 4.1755 1.4424 2.0462 0.4137 10.8640 0.8999 1.7783 4.0848 0.8357 8.1571 14.8116 3.6438 3.7026 5.6880 14.5785 7.3562 11.7362 10.7351 48.6239 113.0920 15.2811 1.4638 107.5183 5.0310 7.1577 3.1667 1.3431 0.9928 32.8332 1.3285 20.3184 0.2471 5.8990 1.2177 57.6599 2.6908 1.8663 18.4560 39.6851 42.3039 55.8979 3.9117 28.4974 7.2881 81.6232 125.7213 20.6124 13.6966 1.1780 27.1595 9.8808 17.2845 1.4661 7.0316 5.6820 28.6770 18.4021 30.8760 34.6944 6.2893 3.1677 12.7303 31.8023 25.2574 44.4431 3.9187 116.8807 8.5600 51.5493 45.1007 19.5932 14.8344 30.8223 29.6907 17.1226 15.5033 10.5481 30.2144 4.8765 31.7510 5.4858 10.6590 13.5373 12.3009 30.2531 16.5921
temp: 298.150 k
press: 1.00000 atm
elementType: 17 17 8 7 6 6 6 6 6 6 6 6 6 6 6 6 1 1 1 1 1 1 1 1 1 1 1 1 1 1 1 1 1
symmnumber: 1
zpe: 703452.9 jmol-1
zpe.correction: 0.267931 hartree
zpe.thermalcorrener: 0.285750 hartree
zpe.thermalcorrenthalpy: 0.286694 hartree
zpe.thermalcorrgfe: 0.218504 hartree
zpe.sumelectzpe: -1516.318565 hartree
zpe.sumelectthermal: -1516.300746 hartree
zpe.sumelectthermalent: -1516.299802 hartree
zpe.sumelectthermalfe: -1516.367992 hartree
dipole: 3.3437 -1.7448 0.5124
dipole: 3.8062
quadrupole: -111.7273 -123.7498 -103.4996
quadrupole: -8.5829 10.8197 5.2612
quadrupole: 1.2650 -10.7576 9.4926 -8.5829 10.8197 5.2612
hfenergy: -1516.5864962 hartree
pointgroup: C01 [X(C12H17Cl2N1O1)]
dipole: -1.384667 -0.3411803 -0.456872 debye
polarizability: 193.5837133|-5.1456054|130.2210226|-1.4664965|10.6159662|176.8737825 unknown
InChI: InChI=1S/C12H17Cl2NO/c1-2-16-12-6-4-3-5-11(12)15(9-7-13)10-8-14/h3-6H,2,7-10H2,1H3
charge 0 multiplicity 1
33 atoms
Cl 3.075145 -1.907559 3.446393
Cl 2.926804 2.318299 -2.490817
O  -0.643135 -1.07089 -1.274861
N  1.014793 0.251786 0.564534
C  -0.404555 0.364045 0.653153
C  1.826421 -0.016746 1.764923
C  1.731449 0.497815 -0.701919
C  -1.272735 -0.286347 -0.290001
C  -1.01369 1.106011 1.700197
C  1.999249 -1.53832 1.924639
C  1.995477 2.005882 -0.864863
C  -2.677313 -0.147673 -0.188265
C  -2.415675 1.214889 1.821492
C  -3.250767 0.59602 0.867621
C  -1.496368 -1.794035 -2.240442
C  -0.560756 -2.567082 -3.166349
H  2.818492 0.461872 1.671114
H  1.355328 0.390922 2.674824
H  2.692271 -0.048878 -0.697005
H  1.143064 0.120795 -1.552133
H  -0.370997 1.624355 2.420568
H  1.039541 -2.043496 2.105961
H  2.524554 -1.991784 1.071111
H  1.061712 2.582214 -0.942716
H  2.642573 2.41579 -0.074187
H  -3.333052 -0.639093 -0.912852
H  -2.846669 1.795963 2.643429
H  -4.339866 0.683965 0.939759
H  -2.174225 -2.477261 -1.688892
H  -2.111495 -1.065632 -2.807485
H  -1.150225 -3.134412 -3.909344
H  0.112118 -1.879842 -3.707194
H  0.056032 -3.279673 -2.592597
