program: Gaussian 09
title: 000227132
version: EM64L-G09RevD.01
frameworkgroup: C1[X(C11H13NO2)]
method: RPBEPBE
basis: SDD
operation: Freq
keyword: #p
keyword: freq=noraman
keyword: PBEPBE/SDD
title: #p freq=noraman PBEPBE/SDD
converged: YES YES NO NO
title: Mulliken charges:
elementType: O O N C C C C C C C C C C C H H H H H H H H H H H H H
charge: -0.483489 -0.266367 -0.468706 0.306904 0.384629 0.124740 -0.313221 -0.801850 -0.408488 -0.347984 -0.248294 -0.225124 0.176059 -0.777619 0.333821 0.269760 0.256689 0.248880 0.218143 0.259553 0.220344 0.231464 0.230929 0.225005 0.226303 0.256897 0.371021
chargesum: 0.00000
title: Mulliken charges with hydrogens summed into heavy atoms:
elementType: O O N C C C C C C C C C C C
charge: -0.112467 -0.266367 -0.134884 0.306904 0.384629 0.124740 -0.043461 -0.078138 -0.148935 -0.127640 -0.016830 0.005805 0.176059 -0.069414
polarizability: 2.30906526e+02 4.30710915e+00 1.48151126e+02 -3.17680486e-01 -1.02931121e+00 7.14179021e+01
1716.lowfreq: -13.8600 -5.5437 -0.0003 0.0004 0.0006 4.9667 36.6361 38.2494 79.7620
frequency: 36.5951 38.2432 79.7509 85.7996 104.5041 179.5717 183.6429 213.0901 228.6822 246.0969 296.1230 327.2007 336.3479 365.2121 443.8069 461.1696 494.7877 524.0675 538.0098 558.3551 568.0819 600.2997 641.3584 670.9035 720.5744 743.8743 766.5304 792.6685 831.6639 842.5626 877.1818 916.9260 923.8887 969.8152 1002.7629 1015.2883 1023.1853 1039.1659 1044.6735 1075.0191 1148.5747 1173.1779 1204.1942 1236.9160 1276.6138 1291.3398 1324.4273 1346.2092 1365.4450 1402.8862 1407.6954 1442.0488 1444.4507 1454.4857 1474.8282 1490.7669 1500.9067 1534.9378 1545.2474 1606.2778 1613.7377 1632.3828 2982.4449 2985.7448 3059.2149 3076.3437 3114.0789 3118.7677 3134.1912 3144.9508 3149.1478 3167.9612 3189.9805 3492.4531 3613.7281
redmass: 3.0637 5.1246 5.2426 2.3722 1.3891 5.1914 3.9608 1.0734 4.5366 3.9237 3.0299 1.2300 3.2495 3.9837 3.1429 5.0426 4.0824 2.9655 5.3468 3.2870 2.9697 4.0870 4.0690 1.3028 3.9134 1.2516 4.2293 5.8132 1.4119 4.4475 1.3161 2.9156 1.3429 1.2929 1.6480 1.7146 1.7363 1.5324 1.8956 2.1805 1.2563 1.0948 2.0696 2.6017 2.0523 1.9320 3.1865 1.6226 1.2961 1.2663 4.7659 1.1410 2.4725 1.0768 1.0644 1.1411 2.5942 1.9281 4.9108 4.9469 6.8566 3.8623 1.0383 1.0409 1.0978 1.0945 1.1005 1.0892 1.0947 1.0882 1.0883 1.0968 1.0954 1.0752 1.0665
irintensity: 3.3491 1.2537 1.9965 1.0304 0.9295 2.2086 2.4071 0.5578 2.9974 2.3070 25.6935 130.9215 1.8039 1.1350 17.3357 14.3053 17.4676 6.2803 8.1602 5.4273 0.8842 4.1905 11.2246 75.8851 9.9245 129.1336 1.7264 23.0908 7.0991 2.2261 20.6872 39.6613 1.1223 0.3141 13.0279 8.7579 1.5237 14.1568 9.2175 149.4581 64.6171 6.4135 22.5607 77.5066 90.7945 255.4240 6.4027 17.4452 49.7193 29.0600 23.9362 89.6740 65.9790 13.3059 33.7949 18.6752 60.8408 434.0779 178.9737 6.7272 296.2144 114.5056 12.2273 18.1046 19.4938 21.9598 20.5602 16.2299 9.0373 5.2308 10.9247 19.4314 2.6624 68.1728 47.8830
temp: 298.150 k
press: 1.00000 atm
elementType: 8 8 7 6 6 6 6 6 6 6 6 6 6 6 1 1 1 1 1 1 1 1 1 1 1 1 1
symmnumber: 1
zpe: 567951.3 jmol-1
zpe.correction: 0.216321 hartree
zpe.thermalcorrener: 0.230434 hartree
zpe.thermalcorrenthalpy: 0.231379 hartree
zpe.thermalcorrgfe: 0.174649 hartree
zpe.sumelectzpe: -631.124276 hartree
zpe.sumelectthermal: -631.110162 hartree
zpe.sumelectthermalent: -631.109218 hartree
zpe.sumelectthermalfe: -631.165947 hartree
dipole: 4.6715 5.1318 1.5608
dipole: 7.1130
quadrupole: -74.6395 -80.1777 -87.6816
quadrupole: -10.0164 -9.0891 -5.1337
quadrupole: 6.1934 0.6552 -6.8486 -10.0164 -9.0891 -5.1337
hfenergy: -631.3405968 hartree
pointgroup: C01 [X(C11H13N1O2)]
dipole: -1.7286175 -1.903639 1.1042669 debye
polarizability: 228.4252334|14.3875976|143.0828716|10.6507031|-20.9640815|78.9674487 unknown
InChI: InChI=1S/C11H13NO2/c1-8(7-9(2)13)12-10-5-3-4-6-11(10)14/h3-7,12,14H,1-2H3
charge 0 multiplicity 1
27 atoms
O  -2.265133 -2.180901 0.059849
O  3.407372 2.122449 -1.071986
N  -0.073895 -0.784471 0.495601
C  -1.213073 -0.030123 0.129654
C  1.289576 -0.468133 0.486565
C  -2.4083 -0.781385 -0.092638
C  -1.293005 1.383651 0.048502
C  2.105656 -1.483839 1.273345
C  1.797768 0.632653 -0.188357
C  -3.625293 -0.156832 -0.415476
C  -2.515468 2.014372 -0.275757
C  -3.680024 1.253589 -0.517397
C  3.162083 1.173083 -0.250869
C  4.302383 0.672739 0.645186
H  -0.308813 -1.752333 0.738335
H  -0.413618 1.994028 0.262412
H  3.102078 -1.635878 0.837608
H  2.23458 -1.162833 2.324031
H  1.593516 -2.463919 1.293254
H  1.117521 1.196896 -0.835113
H  -4.524865 -0.761329 -0.589159
H  -2.551362 3.106872 -0.335652
H  -4.623011 1.745025 -0.776347
H  3.978916 0.463746 1.678853
H  4.747514 -0.25174 0.229205
H  5.086927 1.446249 0.655598
H  -3.121729 -2.64934 -0.085748
