program: Gaussian 09
title: 000227129
version: EM64L-G09RevD.01
frameworkgroup: C1[X(C7H8N2O)]
method: RPBEPBE
basis: SDD
operation: Freq
keyword: #pfreq=noraman
keyword: PBEPBE/SDD
title: #p freq=noraman PBEPBE/SDD
converged: YES YES NO NO
title: Mulliken charges:
elementType: O N N C C C C C C C H H H H H H H H
charge: -0.270967 -0.126325 -0.609088 -0.589878 0.251221 -0.329690 0.194516 -0.167950 -0.179894 -0.344918 0.258648 0.245996 0.245365 0.244515 0.236433 0.245219 0.376545 0.320252
chargesum: 0.00000
title: Mulliken charges with hydrogens summed into heavy atoms:
elementType: O N N C C C C C C C
charge: -0.270967 -0.126325 0.087709 -0.085234 0.251221 -0.084325 0.194516 0.076565 0.056539 -0.099699
polarizability: 1.25194564e+02 -5.10225454e+00 9.49433911e+01 4.26243455e+00 1.46335836e+00 4.66430033e+01
1716.lowfreq: -7.0265 -3.5834 0.0004 0.0004 0.0004 10.0683 42.3303 76.5343 143.8154
frequency: 42.3177 76.5185 143.8148 236.9296 318.8629 360.5404 406.8423 453.8859 502.3196 538.2930 616.2610 630.3438 668.5404 740.7509 756.3298 822.5030 836.0597 862.4015 894.0276 932.9739 962.9323 978.0380 1001.7096 1042.9378 1086.0963 1123.6864 1167.9677 1169.4584 1224.8128 1272.2838 1303.5792 1327.1671 1345.5061 1415.6711 1439.3948 1458.2929 1565.1708 1577.8246 1589.0691 1648.7719 2985.2172 3096.2655 3133.3756 3141.7110 3158.9276 3175.4749 3287.4343 3614.3065
redmass: 4.3232 6.1270 4.3659 3.6184 3.6961 4.6595 3.3677 2.5546 2.2141 3.0363 2.5677 3.5990 2.8432 3.8399 1.2496 1.1040 4.1044 3.5946 1.3459 2.1567 1.5569 5.7981 1.3472 2.3559 1.7235 1.7308 1.0865 1.2142 1.6602 2.5314 2.4071 2.3627 2.5002 1.8387 1.2172 2.0535 5.6894 1.5277 2.9754 7.1501 1.0672 1.0931 1.0881 1.0896 1.0951 1.1015 1.0626 1.0901
irintensity: 4.7922 4.5761 4.7810 6.5850 11.2025 7.7883 4.5962 10.7843 13.5569 20.3035 82.1244 45.3898 53.2060 5.1695 68.7876 94.7746 12.7660 4.1009 1.0599 15.8807 2.2275 7.3755 0.1969 3.9665 6.5251 2.0519 1.3916 10.2211 3.3820 20.0907 8.3992 40.0494 76.5452 16.8281 33.9498 35.5717 9.9782 243.1087 29.6698 347.0271 4.6782 5.8850 12.1290 5.0512 20.5774 19.5215 306.3546 65.1063
temp: 298.150 k
press: 1.00000 atm
elementType: 8 7 7 6 6 6 6 6 6 6 1 1 1 1 1 1 1 1
symmnumber: 1
zpe: 371641.5 jmol-1
zpe.correction: 0.141551 hartree
zpe.thermalcorrener: 0.150148 hartree
zpe.thermalcorrenthalpy: 0.151092 hartree
zpe.thermalcorrgfe: 0.107103 hartree
zpe.sumelectzpe: -455.562636 hartree
zpe.sumelectthermal: -455.554038 hartree
zpe.sumelectthermalent: -455.553094 hartree
zpe.sumelectthermalfe: -455.597083 hartree
dipole: -5.4100 0.9638 0.4126
dipole: 5.5107
quadrupole: -65.2788 -50.6096 -60.6325
quadrupole: 7.1261 4.1468 -2.2393
quadrupole: -6.4385 8.2307 -1.7922 7.1261 4.1468 -2.2393
hfenergy: -455.7041867 hartree
pointgroup: C01[X(C7H8N2O1)]
dipole: -2.0765256 -0.5832783 0.2199536 debye
dipolederiv: -1.1002779 -0.4016438 0.0452701 -0.2797565 -0.7363524 0.099922 -0.1518717 0.0274069 -0.4142958 -0.6123597 -0.0173019 0.0761689 -0.1575166 -0.3729354 0.0729236 0.1107385 0.0173946 -0.2805941 -0.6557041 0.0832605 0.0841317 -0.0973704 -1.0179701 0.103677 0.0921603 0.1371325 -0.648819 -0.5873404 -0.0304661 -0.0624302 0.0786187 0.0824759 0.0168099 -0.0970974 0.0982544 -0.050316 0.7394353 0.1517589 -0.2620174 0.0681189 0.0867827 0.0165048 -0.4077301 -0.0632998 0.1191949 -0.4644087 -0.062857 0.0969944 0.1485757 0.0592572 -0.0885453 0.1364452 -0.0142835 -0.1281756 1.3724146 0.3730933 0.1308419 0.2220857 1.2400351 -0.3395738 0.4000787 -0.3472903 0.4001662 0.2053069 -0.0434084 -0.0896783 0.0074481 0.1674148 -0.0487045 -0.0939227 -0.0479935 -0.0608318 -0.0508048 0.1500035 -0.0780006 -0.031651 -0.263899 0.0282322 -0.0128018 -0.0150651 -0.1114641 0.1551168 -0.123082 -0.0427495 0.1392778 0.3514302 -0.121466 -0.1069756 -0.0612499 -0.0189491 0.0513843 -0.0007815 0.0240656 -0.0269723 0.0687017 -0.0746874 0.0510678 -0.0366488 -0.032046 0.0345055 0.0275218 0.0031204 0.0094254 -0.0733233 0.0341439 -0.0032614 -0.0017924 0.1207908 0.0918696 -0.0407371 0.0307646 -0.0223701 -0.0559138 0.0607621 0.0206892 0.063298 0.1311442 -0.020407 0.0933336 0.0309788 0.1015202 0.0206517 -0.0042791 0.0249957 -0.0046384 0.1401219 -0.0517783 -0.0578087 0.0850416 -0.0465085 0.0791666 0.0384623 0.0885394 0.0426142 0.1299908 0.0733728 -0.0126219 0.0214077 -0.0577558 -0.0890789 0.0687282 0.0270938 0.0614691 0.1118951 0.7020536 -0.0618235 -0.0244607 -0.0223186 0.2245205 0.0657263 0.004239 0.0741682 0.2851721 0.1176215 -0.0264395 -0.0694491 -0.0328506 0.2290367 0.0713639 -0.0823868 0.0705236 0.3070154 unknown
polarizability: 122.2193642|4.5017401|91.7478866|-13.2996671|-14.4456322|52.8137071 unknown
InChI: InChI=1S/C7H8N2O/c8-7(10)5-6-3-1-2-4-9-6/h1-4H,5,8H2
charge 0 multiplicity 1
18 atoms
O  3.610611 1.157768 -0.358087
N  -0.187297 -0.893866 -0.133326
N  2.567268 -0.868048 0.158843
C  1.305318 0.816989 -1.128069
C  -0.025374 0.416942 -0.515421
C  -1.077479 1.357974 -0.373749
C  2.600287 0.393329 -0.38575
C  -2.317756 0.941266 0.15705
C  -2.483055 -0.409729 0.538771
C  -1.387426 -1.286285 0.379379
H  1.376773 0.375815 -2.143481
H  1.360989 1.910254 -1.247641
H  -0.918833 2.397682 -0.676483
H  -3.13842 1.657288 0.271821
H  -3.427194 -0.775822 0.952803
H  -1.463423 -2.340159 0.669741
H  1.67078 -1.383999 0.136974
H  3.393331 -1.216199 0.644225
