program: Gaussian 09
title: 000227128
version: EM64L-G09RevD.01
frameworkgroup: C1[X(C7H8N2O)]
method: RPBEPBE
basis: SDD
operation: Freq
keyword: #pfreq=noraman
keyword: PBEPBE/SDD
title: #p freq=noraman PBEPBE/SDD
converged: YES YES NO NO
title: Mulliken charges:
elementType: O N N C C C C C C C H H H H H H H H
charge: -0.259299 -0.009927 -0.600356 0.481116 -0.634438 -0.306007 -0.367219 0.237927 -0.326975 -0.320435 0.259747 0.207411 0.273193 0.228106 0.240974 0.238924 0.318690 0.338567
chargesum: 0.00000
title: Mulliken charges with hydrogens summed into heavy atoms:
elementType: O N N C C C C C C C
charge: -0.259299 -0.009927 0.056901 0.481116 -0.167279 -0.032814 -0.139113 0.237927 -0.086001 -0.081511
polarizability: 1.06552588e+02 -1.33679672e-01 9.73867795e+01 5.68275131e+00 8.42275067e-01 5.33961592e+01
1716.lowfreq: -5.2912 -3.5518 -0.0008 -0.0005 0.0005 13.2193 29.8701 41.2039 107.6431
frequency: 29.7794 41.1691 107.6400 223.3103 294.9481 369.5324 398.4531 462.1842 487.9885 512.3033 536.7357 621.0261 661.9577 704.4677 742.4017 794.2207 840.7529 868.6911 888.8264 926.8011 959.8260 965.3751 983.4614 1052.1830 1065.1336 1087.8567 1154.1034 1210.6962 1223.4955 1272.4886 1308.3230 1332.4780 1356.4711 1405.1525 1457.0294 1466.4427 1557.2094 1582.3116 1599.1044 1648.4473 3008.1827 3070.0844 3121.4499 3134.1772 3145.4481 3163.6329 3518.9037 3674.6357
redmass: 4.9001 3.8614 6.8245 5.1271 4.5926 2.4962 2.2509 2.4093 1.9753 1.8933 2.7453 1.5115 6.7789 3.7349 3.7874 1.6347 3.2397 2.8405 1.2556 1.8564 6.4823 1.4611 1.4591 1.7352 2.2408 1.5970 1.2053 2.1325 1.4126 1.5829 6.0982 1.6524 2.3238 2.0488 1.1561 1.8003 6.9194 4.2035 1.5766 3.4750 1.0591 1.1030 1.0874 1.0891 1.0975 1.0974 1.0450 1.1042
irintensity: 13.9261 3.7677 3.0854 0.2877 3.5389 0.0088 5.0387 6.6995 56.7571 82.5785 60.9598 145.1127 1.2164 18.4307 0.2730 36.5993 10.3549 9.6102 1.4699 5.4235 3.3952 0.6636 0.5733 1.8028 4.9054 0.8095 31.0727 1.0574 2.1578 9.1166 10.0035 40.6492 140.7251 23.6735 19.2429 9.4519 15.9558 87.1885 33.1708 281.3644 19.1973 12.0027 7.4344 24.0327 28.4861 3.6456 34.5858 24.3674
temp: 298.150 k
press: 1.00000 atm
elementType: 8 7 7 6 6 6 6 6 6 6 1 1 1 1 1 1 1 1
symmnumber: 1
zpe: 371065.4 jmol-1
zpe.correction: 0.141331 hartree
zpe.thermalcorrener: 0.150252 hartree
zpe.thermalcorrenthalpy: 0.151196 hartree
zpe.thermalcorrgfe: 0.105724 hartree
zpe.sumelectzpe: -455.552452 hartree
zpe.sumelectthermal: -455.543531 hartree
zpe.sumelectthermalent: -455.542587 hartree
zpe.sumelectthermalfe: -455.588059 hartree
dipole: 2.7138 -4.2824 0.0088
dipole: 5.0699
quadrupole: -66.2208 -53.0650 -57.6438
quadrupole: -8.0761 -5.6648 1.3392
quadrupole: -7.2442 5.9115 1.3327 -8.0761 -5.6648 1.3392
hfenergy: -455.693783 hartree
pointgroup: C01 [X(C7H8N2O1)]
dipole: -1.2946487 -1.4262259 -0.5180797 debye
dipolederiv: -0.6134353 0.0914453 0.0970372 -0.0283678 -0.9945578 0.0140007 0.1489679 -0.1394888 -0.4351253 -0.3855566 0.011503 -0.0359131 0.0102674 -0.3594492 -0.0217087 -0.0494095 -0.0261488 -0.274604 -0.940073 -0.3752613 -0.0452006 -0.3057376 -0.6146328 0.1987795 0.1075694 0.2898683 -0.5883167 0.5294244 -0.0883391 0.1344573 -0.0110305 0.1020028 -0.015667 0.3200543 -0.0391352 0.0203753 -0.4103536 0.1409306 0.1214963 0.2333899 0.0530689 0.011593 0.1181963 -0.033489 -0.0211087 -0.2962742 -0.1516546 -0.1001957 -0.127356 -0.0614712 -0.0288989 -0.1363783 -0.0405135 -0.1518872 -0.3302816 0.1819809 -0.0006946 0.1013898 -0.06 0.0642238 -0.0762019 0.1098846 -0.1002998 1.0967739 0.2448008 -0.4198662 0.2188647 1.3527083 -0.0992562 -0.734947 -0.0092038 0.4727367 0.2082932 0.1465172 0.1558603 0.0056384 0.2566287 0.0788226 0.1243719 0.1588891 0.0197232 0.2234327 -0.2084974 0.0736982 -0.0457461 0.2624168 0.0514091 0.1114441 -0.0117778 -0.022178 0.0649412 -0.004497 -0.0189612 0.0072843 0.0263894 0.0965935 -0.0280796 0.0473887 0.0020301 0.0045981 -0.0245047 -0.0112463 -0.0785766 -0.1036564 -0.1127369 0.0105621 -0.0463284 0.0606326 0.120743 0.0827732 -0.0180046 0.0550817 0.0204028 -0.0070418 -0.0059324 -0.0066568 0.1356485 0.0594235 -0.0930766 -0.0721388 -0.0594115 -0.0363145 -0.0748168 -0.0549228 -0.0904236 0.0980617 0.0550474 -0.0658845 -0.0503 -0.0545379 -0.057721 -0.0714589 -0.0515209 -0.0795151 0.093198 0.0393753 0.0978461 -0.0148386 0.0866812 -0.0861059 -0.0172356 -0.0216751 -0.0079076 0.1233377 0.3036639 0.0156815 0.0984409 0.0204868 0.1306617 -0.0371266 0.0921011 -0.0370734 0.2840244 0.2702576 -0.0017634 0.1063693 -0.02832 0.1696293 -0.0294749 0.1258004 -0.0383689 0.2837515 unknown
polarizability: 104.2717961|-3.7741278|95.9902275|11.1718673|8.1426415|57.0735028 unknown
InChI: InChI=1S/C7H8N2O/c8-7(10)5-6-1-3-9-4-2-6/h1-4H,5,8H2
charge 0 multiplicity 1
18 atoms
O  -2.396641 1.851411 -0.015986
N  2.695975 -0.187173 0.598831
N  -3.201807 -0.310089 0.239713
C  0.103588 -0.029975 -0.613544
C  -1.272283 0.05573 -1.268258
C  0.712399 1.112052 -0.032031
C  0.823304 -1.249209 -0.570094
C  -2.333976 0.62114 -0.304068
C  1.990205 0.984655 0.555239
C  2.100734 -1.279839 0.036553
H  -1.231632 0.755556 -2.122806
H  -1.568885 -0.933848 -1.659224
H  0.189727 2.073932 -0.027496
H  0.406312 -2.164332 -1.006555
H  2.481758 1.851033 1.012078
H  2.677161 -2.211417 0.078067
H  -3.138434 -1.303871 0.02865
H  -3.905006 0.012343 0.90493
