program: Gaussian 09
title: 000227126
version: EM64L-G09RevD.01
frameworkgroup: C1[X(C15H14N2O3)]
method: RPBEPBE
basis: SDD
operation: Freq
keyword: #p
keyword: freq=noraman
keyword: PBEPBE/SDD
title: #p freq=noraman PBEPBE/SDD
converged: YES YES NO NO
title: Mulliken charges:
elementType: O O O N N C C C C C C C C C C C C C C C H H H H H H H H H H H H H H
charge: -0.433452 -0.212176 -0.273575 -0.413429 -0.000229 -0.138831 -0.600895 0.535995 0.163138 -0.433911 -0.355308 0.209769 0.287984 -0.225675 -0.231097 -0.238616 -0.281557 -0.300711 -0.330136 -0.337088 0.305781 0.216992 0.249502 0.325650 0.226117 0.229510 0.225582 0.228316 0.229787 0.273131 0.218097 0.391807 0.246771 0.242760
chargesum: 0.00000
title: Mulliken charges with hydrogens summed into heavy atoms:
elementType: O O O N N C C C C C C C C C C C C C C C
charge: -0.041646 -0.212176 -0.273575 -0.087778 -0.000229 0.166951 -0.134400 0.535995 0.163138 -0.207794 -0.125799 0.209769 0.287984 -0.000094 -0.002781 -0.008829 -0.008426 -0.082614 -0.083365 -0.094328
polarizability: 1.80212078e+02 -1.97507523e+01 1.76242116e+02 -1.27432418e+01 -3.97585545e+00 1.70071692e+02
1716.lowfreq: -15.8548 -10.5002 -5.0682 -0.0006 -0.0005 0.0006 2.2425 13.5107 21.0497
frequency: -15.1371 13.0166 20.8602 34.2906 50.9237 60.4158 78.3161 92.0489 142.0631 159.8101 221.0330 234.5422 288.9671 307.1477 337.2776 365.6014 383.5552 400.2575 419.4737 473.2516 484.5056 534.2430 555.6994 561.6964 592.2097 614.7282 618.2284 655.6549 660.0970 692.2057 693.9897 700.5734 752.1544 753.8958 797.7311 832.9980 837.2242 847.1706 874.4405 889.0919 890.6359 924.3182 958.2553 965.7927 972.2709 989.5224 990.6211 995.2391 999.3483 1027.0631 1058.6540 1069.8991 1079.7197 1084.4680 1091.5248 1144.3662 1173.3100 1188.4188 1200.7573 1215.5588 1219.2063 1263.0236 1267.9894 1299.1314 1301.0402 1309.4037 1324.3289 1326.5718 1335.5119 1384.6291 1399.1613 1441.4304 1457.6935 1467.4121 1484.4804 1489.7416 1545.9279 1583.0187 1595.0795 1598.3755 1615.2861 1670.1452 2991.7873 3039.0876 3057.0669 3115.0612 3120.0760 3127.5166 3134.1475 3141.1131 3147.0801 3150.7429 3164.9313 3174.4382 3523.9732 3560.8401
redmass: 3.8772 4.6861 4.8636 9.5306 7.3224 5.5892 5.6305 5.2175 6.6203 6.4806 5.3013 6.3365 4.9941 6.6241 2.3202 2.4794 3.9853 2.7790 6.7221 4.1701 3.5692 4.8674 1.7493 2.5847 1.6676 2.9136 3.8148 6.9942 6.8656 3.8900 4.2627 1.8195 2.6152 1.8985 5.4430 5.1061 1.6956 1.2584 1.8841 3.8551 1.2646 1.6666 3.3630 1.8219 1.3998 1.4451 5.7678 1.3327 3.0636 2.1782 2.6030 2.6689 2.1531 1.6036 1.7548 2.1473 1.0571 1.1284 1.4988 2.4441 1.2999 1.5729 1.6845 2.1067 4.4420 1.3746 1.5679 1.6300 1.2537 7.4464 1.8661 2.1283 1.7386 1.2210 2.3216 1.9344 7.3933 5.7037 6.0699 7.6410 6.1834 9.3167 1.0592 1.0880 1.0984 1.0874 1.0874 1.0874 1.0906 1.0898 1.0957 1.0974 1.1015 1.0965 1.0643 1.0772
irintensity: 0.3219 0.1767 0.0388 2.8481 1.6711 2.6206 1.0137 1.7678 0.1407 8.8248 9.1992 5.4778 2.1684 2.9590 0.6668 0.2051 5.0693 0.0690 3.2051 14.9838 1.9447 34.6875 42.3324 6.3533 217.6495 29.4561 20.8732 9.6672 1.5485 27.9951 42.8830 45.0619 26.7339 37.8947 5.8368 2.7765 32.6258 1.5079 6.8659 46.3847 4.7170 10.0439 1.7729 0.5032 0.1443 1.5073 0.2253 0.1398 0.4094 6.6520 2.8734 29.7733 203.2296 4.9362 17.4670 9.9632 0.1082 2.9366 11.2141 2.7025 3.2350 29.2909 31.1503 55.2696 17.3011 2.0900 13.7594 42.6477 0.5134 0.2022 11.8236 9.4427 72.3309 33.5956 23.1003 222.4391 50.7788 6.7876 0.1912 77.0419 5.1773 265.7440 24.0370 8.9638 12.8440 8.4252 6.2346 8.3937 9.9875 24.9987 34.0534 18.2276 20.2764 5.1117 37.0297 27.9490
temp: 298.150 k
press: 1.00000 atm
elementType: 8 8 8 7 7 6 6 6 6 6 6 6 6 6 6 6 6 6 6 6 1 1 1 1 1 1 1 1 1 1 1 1 1 1
symmnumber: 1
zpe: 687120.5 jmol-1
zpe.correction: 0.261710 hartree
zpe.thermalcorrener: 0.278722 hartree
zpe.thermalcorrenthalpy: 0.279667 hartree
zpe.thermalcorrgfe: 0.213118 hartree
zpe.sumelectzpe: -913.761180 hartree
zpe.sumelectthermal: -913.744168 hartree
zpe.sumelectthermalent: -913.743224 hartree
zpe.sumelectthermalfe: -913.809773 hartree
dipole: -1.0930 0.9177 -3.3367
dipole: 3.6291
quadrupole: -134.3999 -108.3028 -109.8497
quadrupole: 7.8239 4.2722 -7.9494
quadrupole: -16.8824 9.2147 7.6677 7.8239 4.2722 -7.9494
hfenergy: -914.0228908 hartree
pointgroup: C01 [X(C15H14N2O3)]
dipole: 0.3684599 -0.3067231 -1.3448928 debye
polarizability: 177.8955893|-20.522717|178.7229493|11.5167245|4.1087059|169.9073473 unknown
InChI: InChI=1S/C15H14N2O3/c18-14(12-6-8-16-9-7-12)17-13(15(19)20)10-11-4-2-1-3-5-11/h1-9,13,17,19H,10H2
charge 0 multiplicity 1
34 atoms
O  0.361804 -3.54049 -1.203544
O  2.184571 -3.924143 0.189669
O  -0.432696 -0.34057 1.951763
N  -0.101677 -1.104579 -0.224411
N  -4.794762 1.051365 -0.323274
C  1.221984 -1.65354 0.064834
C  2.37695 -0.914678 -0.704845
C  2.437471 0.570647 -0.385765
C  1.321504 -3.143241 -0.257266
C  2.1242 1.536518 -1.374232
C  2.814202 1.017572 0.906945
C  -0.848256 -0.469084 0.757904
C  -2.200414 0.049825 0.332662
C  2.187099 2.918712 -1.082414
C  2.877728 2.395739 1.20296
C  2.564173 3.35223 0.208601
C  -3.160243 0.307133 1.341846
C  -2.559142 0.323031 -1.011537
C  -4.430989 0.795999 0.971244
C  -3.854437 0.817637 -1.286145
H  1.38232 -1.531475 1.15125
H  2.232737 -1.067658 -1.791327
H  3.321799 -1.417033 -0.422593
H  -0.525747 -1.339717 -1.12289
H  1.837119 1.206184 -2.380562
H  3.055653 0.28616 1.688116
H  1.943655 3.652887 -1.858705
H  3.167509 2.723985 2.207188
H  2.612164 4.422354 0.43878
H  -2.896118 0.129241 2.388344
H  -1.850229 0.198009 -1.83748
H  0.479922 -4.505727 -1.41464
H  -5.197162 0.99695 1.727895
H  -4.159093 1.045258 -2.313872
