program: Gaussian 09
title: 000227124
version: EM64L-G09RevD.01
frameworkgroup: C1[X(C11H10N4)]
method: RPBEPBE
basis: SDD
operation: Freq
keyword: #pfreq=noraman
keyword: PBEPBE/SDD
title: #p freq=noraman PBEPBE/SDD
converged: NO YES NO NO
title: Mulliken charges:
elementType: N N N N C C C C C C C C C C C H H H H H H H H H H
charge: -0.378014 -0.078021 0.012683 -0.003748 0.422824 0.191490 -0.291177 -0.305899 -0.378607 -0.460927 -0.160490 -0.181861 -0.196269 -0.323728 -0.331922 0.267560 0.266906 0.209814 0.297989 0.239305 0.236687 0.230718 0.232498 0.238686 0.243502
chargesum: 0.00000
title: Mulliken charges with hydrogens summed into heavy atoms:
elementType: N N N N C C C C C C C C C C C
charge: -0.080024 -0.078021 0.012683 -0.003748 0.422824 0.191490 -0.023617 -0.038993 -0.168793 -0.221622 0.076197 0.048857 0.036229 -0.085042 -0.088420
polarizability: 3.37321712e+02 -3.92014649e-01 1.46165751e+02 -2.08214002e-03 5.19749113e-04 5.60060759e+01
1716.lowfreq: -9.8641 -0.0009 0.0003 0.0007 3.7587 4.2995 37.9780 48.2444 55.2756
frequency: 37.9201 48.2423 55.2709 115.3688 171.6978 218.3952 249.1069 250.3607 300.4991 376.8684 393.1490 413.3050 504.0475 508.2672 516.6632 605.5704 608.6934 646.8461 661.8206 667.9554 716.6794 741.5556 779.2522 819.7931 820.9604 885.6123 894.9218 899.5280 926.8982 946.4420 950.9962 954.8213 994.3957 997.1823 1000.2755 1026.5735 1031.2505 1080.3097 1102.1697 1139.1032 1158.8087 1197.7273 1247.8736 1264.4277 1296.4058 1314.6597 1324.7647 1339.1750 1358.6351 1402.7780 1426.3620 1444.4343 1464.2358 1522.6739 1541.8211 1566.8304 1578.6403 1584.4803 1591.0063 2988.8628 3108.0319 3133.1348 3135.1590 3145.3046 3151.5556 3170.9427 3173.6780 3190.9224 3389.2329
redmass: 4.6102 5.0524 5.2709 4.9834 5.0731 4.7612 2.7695 7.5279 4.2614 5.3441 3.1423 3.6147 6.8734 2.7748 3.6015 7.5233 8.0526 6.7188 1.2273 6.2144 1.8739 2.2318 1.7885 1.6465 5.5914 1.3251 4.1461 1.4007 1.4259 1.5656 1.4220 6.5793 1.3248 1.3659 3.7216 2.9932 2.2461 1.9234 1.6830 2.6436 1.0964 1.4069 1.7301 1.6743 2.3066 5.4641 1.7761 1.9947 1.9361 2.0548 2.0581 2.2054 2.2067 2.5769 5.3949 5.4199 5.2313 6.4129 6.0040 1.0870 1.0909 1.0880 1.0884 1.0907 1.0921 1.0997 1.0976 1.0968 1.0747
irintensity: 0.2836 0.1181 0.3400 1.9359 14.0584 0.9986 29.0728 0.4770 4.3811 16.6680 1.8787 2.8335 6.6280 18.6596 0.0198 8.8178 1.4762 10.0497 80.2385 0.2408 34.6287 12.3701 78.9272 28.9379 0.4316 1.1733 2.3780 9.1235 21.7024 14.4852 1.9238 13.6336 0.3295 1.3685 11.5543 4.7374 4.9855 45.0038 29.2433 148.2567 0.9342 1.5562 2.5617 24.9771 90.3693 11.4379 3.3430 6.1869 7.0304 14.7559 66.6980 180.9595 68.2285 250.0358 112.2952 149.6230 74.5758 3.5695 306.2154 47.0430 25.4783 2.5748 21.8690 13.4503 19.7873 18.0472 30.7794 3.0837 10.4380
temp: 298.150 k
press: 1.00000 atm
elementType: 7 7 7 7 6 6 6 6 6 6 6 6 6 6 6 1 1 1 1 1 1 1 1 1 1
symmnumber: 1
zpe: 504054.5 jmol-1
zpe.correction: 0.191984 hartree
zpe.thermalcorrener: 0.204072 hartree
zpe.thermalcorrenthalpy: 0.205016 hartree
zpe.thermalcorrgfe: 0.152066 hartree
zpe.sumelectzpe: -643.093138 hartree
zpe.sumelectthermal: -643.081050 hartree
zpe.sumelectthermalent: -643.080106 hartree
zpe.sumelectthermalfe: -643.133057 hartree
dipole: -2.3330 1.7613 0.0002
dipole: 2.9232
quadrupole: -91.9360 -76.0992 -92.7060
quadrupole: 2.3783 0.0016 0.0000
quadrupole: -5.0222 10.8145 -5.7923 2.3783 0.0016 0.0000
hfenergy: -643.2851222 hartree
pointgroup: C01 [X(C11H10N4)]
dipole: 0.9148453 0.6969251 -0.0000762 debye
dipolederiv: -2.4731952 -0.3249903 -0.0000169 0.4096114 -0.018873 0.0000159 0.0000128 0.0000165 -0.3002524 -1.1448554 -0.2429885 -0.0000133 0.2260575 -0.3343971 -0.0000096 0.00003 -0.0000055 -0.2480858 1.6844451 0.0223713 -0.0000019 -0.7900144 -0.3030853 -0.0000126 -0.0000776 -0.0000071 -0.0935627 -0.2775452 -0.0165248 0.0000072 0.0094126 -0.3190477 0.0000083 -0.0000082 0.000007 -0.2423198 0.6190873 -0.1668199 0.0000144 -0.2389743 -0.2260084 0.0000225 0.0000235 0.0000196 0.0714001 2.1714814 0.4209064 0.0000184 1.3106106 0.3368711 0.0000122 0.0000565 0.0000101 0.141883 -0.05348 0.0310188 -0.0000231 0.1846388 0.036604 -0.0000253 -0.0000281 -0.0000133 -0.1185037 -0.3811898 -0.0299741 -0.0000063 -0.7874804 -0.2438775 0.0000016 -0.0000462 -0.0000047 -0.1474558 -0.6466603 -0.0073297 0.0000042 -0.5230616 0.4282174 0.0000151 -0.0000174 0.0000034 -0.1379617 -0.148623 0.1031341 -0.000021 -0.028067 0.3255426 -0.0000358 0.0000096 -0.0000401 -0.1039293 0.4657964 -0.0284843 -0.0000094 0.0821858 0.2313164 0.0000273 -0.0000033 0.0000276 -0.1123287 -0.230235 0.0338119 0.0000043 -0.1839211 0.1123254 -0.0000223 0.0000334 -0.0000274 -0.101945 -0.3451326 0.0501647 0.000001 0.2103705 -0.3126062 -0.0000171 0.000013 -0.0000135 -0.1622942 0.5196867 0.1112031 0.0000038 -0.2538884 0.3672615 0.0000357 -0.000032 0.0000301 -0.0800776 0.1740833 -0.1340914 -0.000014 0.1273646 0.096239 -0.0000159 -0.0000406 -0.0000104 -0.0921781 0.0266601 -0.0896923 0.0000221 -0.0738214 0.0545827 0.0000138 0.0000197 0.0000112 0.1417338 0.0366901 0.0813853 0.0000109 0.1126647 0.0584338 -0.0000104 0.0000157 -0.0000092 0.1735881 -0.0072198 0.023635 0.000005 0.0540929 -0.1756029 -0.0000078 0.0000103 -0.0000034 0.1869404 0.0491352 -0.0110994 0.0000004 -0.0468928 0.0734137 -0.000013 0.0000134 -0.0000076 0.3294131 0.0923484 0.0579435 -0.0000004 0.0514665 -0.1113045 0.0000205 -0.0000045 0.0000174 0.1354917 0.0863437 -0.0132824 -0.0000005 -0.0581026 -0.0992117 -0.0000191 -0.0000053 -0.0000193 0.1456296 0.0758982 0.0170252 0.0000019 0.0765516 -0.1119799 0.0000269 -0.0000018 0.0000298 0.1578283 -0.1007177 -0.0653372 0.0000006 -0.0850345 0.0679713 -0.0000067 0.0000035 -0.0000052 0.180077 -0.1003338 0.0790803 0.0000087 0.1277723 0.0251478 -0.0000094 0.0000124 -0.0000086 0.1332329 -0.0924679 0.0989347 0.0000037 0.0864587 0.0420672 0.0000052 0.0000113 0.0000026 0.1436766 unknown
polarizability: 337.314705|1.2219282|146.1727584|-0.0020799|-0.0005288|56.0060759 unknown
InChI: InChI=1S/C11H10N4/c1-2-7-13-11(5-1)15-14-9-10-4-3-6-12-8-10/h1-9,15H
charge 0 multiplicity 1
25 atoms
N  1.205783 -1.023289 -0.000029
N  3.517097 -1.175891 -0.000083
N  0.018249 -0.348039 -0.000002
N  -4.856628 -0.649647 0.000151
C  -2.407072 -0.38435 -0.000001
C  2.433295 -0.345078 -0.000003
C  -2.558958 1.032745 -0.000146
C  2.524747 1.073169 0.000105
C  -1.10231 -1.047593 -0.000014
C  -3.596466 -1.169099 0.000133
C  3.813576 1.638976 0.000123
C  -3.853903 1.582846 -0.000122
C  4.956144 0.797607 0.00004
C  4.752409 -0.600146 -0.000059
C  -4.972759 0.711672 0.000032
H  -1.666559 1.666097 -0.000273
H  1.616892 1.679581 0.000176
H  -1.103877 -2.155639 -0.000034
H  1.265433 -2.053807 -0.000083
H  -3.535305 -2.265574 0.000228
H  3.928297 2.728292 0.000207
H  -4.004454 2.667284 -0.000231
H  5.969153 1.209847 0.000048
H  5.598849 -1.296044 -0.000121
H  -5.995734 1.10448 0.000057
