program: Gaussian 09
title: 000227119
version: EM64L-G09RevD.01
frameworkgroup: C1[X(C8H8N4O2)]
method: RPBEPBE
basis: SDD
operation: Freq
keyword: #pfreq=noraman
keyword: PBEPBE/SDD
title: #p freq=noraman PBEPBE/SDD
converged: YES YES NO NO
title: Mulliken charges:
elementType: O O N N N N C C C C C C C C H H H H H H H H
charge: -0.232366 -0.319183 -0.389298 -0.377380 -0.491380 -0.030635 0.192042 0.354487 -0.420388 0.098525 0.046229 -0.783717 0.199295 -0.226474 0.296579 0.344859 0.249351 0.262993 0.249493 0.346043 0.304905 0.326020
chargesum: 0.00000
title: Mulliken charges with hydrogens summed into heavy atoms:
elementType: O O N N N N C C C C C C C C
charge: -0.232366 -0.319183 -0.044439 -0.031337 0.139545 -0.030635 0.192042 0.354487 -0.123808 0.098525 0.046229 -0.021879 0.199295 -0.226474
polarizability: 1.91837122e+02 1.54969299e+01 1.56178511e+02 5.01640934e-01 1.10163999e+00 5.54191335e+01
1716.lowfreq: -4.5918 0.0006 0.0008 0.0010 8.1157 8.7235 40.2488 66.6019 92.9990
frequency: 40.2106 66.5973 92.9966 119.9072 146.9612 157.9626 168.9017 204.4538 226.1718 253.6605 262.2433 309.2949 333.0308 404.6002 421.0795 453.4947 482.1940 533.2901 551.0107 608.6319 623.8535 636.8345 703.3944 708.2770 759.0055 770.0381 788.0861 795.0706 902.6946 931.3091 989.1723 1032.9788 1050.4925 1090.0911 1130.8788 1194.1113 1225.5318 1240.4764 1270.4958 1296.3070 1396.5530 1402.2542 1432.2028 1466.7334 1472.9285 1502.5122 1506.0192 1550.7732 1618.4619 1629.6299 1655.7248 2155.3645 2983.4108 3059.9066 3120.2637 3197.0005 3382.7915 3499.2581 3502.4321 3520.7427
redmass: 6.6647 8.5795 1.1775 2.8073 7.7751 4.8907 4.9186 1.3084 4.1536 6.3781 3.7790 5.1787 4.7071 6.7837 6.1907 8.8812 6.8796 6.3116 7.2276 4.0847 1.2284 4.5452 3.4888 5.6282 2.1072 5.5551 2.6747 1.7149 1.2954 5.5883 1.8141 3.1889 1.5399 3.5187 5.3379 1.7217 6.9123 2.9034 1.2418 2.3789 2.4201 1.2242 2.6353 1.0434 1.3102 2.8587 2.5194 8.1291 5.1337 6.1771 1.1098 12.5917 1.0392 1.0977 1.0973 1.0928 1.0430 1.0772 1.0834 1.0977
irintensity: 10.7894 0.9824 0.3349 0.9080 6.5315 6.1138 2.2537 93.9303 2.2039 3.5501 2.1670 27.1916 7.3376 19.8028 1.7411 2.4166 4.5447 13.9186 2.4358 0.6489 128.3649 11.0743 12.3261 17.7813 46.2416 3.7456 132.6777 323.1943 19.8886 5.9234 1.2279 5.7404 15.1361 8.2621 9.0850 13.9768 14.9577 1.9305 10.7851 8.8957 1.2250 24.4369 45.5418 18.3775 35.5414 62.2480 85.6922 117.1244 328.3695 416.0935 31.6345 33.6512 16.8534 9.7632 7.4114 12.4881 15.1783 65.9880 66.4659 32.7497
temp: 298.150 k
press: 1.00000 atm
elementType: 8 8 7 7 7 7 6 6 6 6 6 6 6 6 1 1 1 1 1 1 1 1
symmnumber: 1
zpe: 418876.9 jmol-1
zpe.correction: 0.159542 hartree
zpe.thermalcorrener: 0.173042 hartree
zpe.thermalcorrenthalpy: 0.173987 hartree
zpe.thermalcorrgfe: 0.119096 hartree
zpe.sumelectzpe: -678.082217 hartree
zpe.sumelectthermal: -678.068717 hartree
zpe.sumelectthermalent: -678.067772 hartree
zpe.sumelectthermalfe: -678.122664 hartree
dipole: -3.0548 -5.1723 1.1253
dipole: 6.1115
quadrupole: -60.1940 -102.7983 -81.4243
quadrupole: 9.2773 5.8530 -0.0089
quadrupole: 21.2782 -21.3261 0.0479 9.2773 5.8530 -0.0089
hfenergy: -678.2417591 hartree
pointgroup: C01 [X(C8H8N4O2)]
dipole: 1.1668978 2.0996417 -0.106199 debye
dipolederiv: -0.6342757 0.442378 -0.0705278 0.4781081 -1.0480421 0.1061253 -0.0761939 0.1091432 -0.3710729 -0.4974539 0.2314457 -0.0263345 -0.21476 -0.8865197 0.1384331 0.0767981 0.1026102 -0.4035208 -0.4733708 -0.3490951 0.0909653 0.5687572 -0.6390313 0.0300406 -0.1029182 0.1105313 -0.2804829 0.2225501 -0.1142634 0.0892658 -0.2285289 -0.4510713 0.1466373 0.1025171 0.1685749 -0.4019546 -1.0414223 -0.0856312 -0.0761496 -0.2161978 -0.2901039 -0.1053009 -0.3096429 -0.0973566 -0.1698425 -0.3785795 -0.0913782 0.0316077 -0.0976637 -0.3171364 0.0250029 0.0300522 0.0272778 -0.2471399 0.6886182 0.1723955 -0.0718606 0.4153564 0.6513483 -0.1615639 -0.10044 -0.1319522 0.1339852 1.1891227 0.4298702 -0.1881829 -0.5585452 0.2943502 -0.0003992 0.0107125 -0.0813807 0.084462 -1.1195348 -0.5781814 0.2026432 -0.160166 -0.3091097 0.0356384 0.0834444 0.0769523 -0.2228408 -0.4780218 0.4263332 -0.0489999 -0.0850501 -0.5248234 0.1311451 0.0698749 0.0741775 0.0003348 0.7774146 -0.5067344 0.0605924 -0.6425394 1.32011 -0.1826953 0.0782891 -0.1912278 0.2347755 -0.168613 -0.1765514 0.0571446 -0.025871 -0.05015 0.0254207 0.0283158 0.035379 0.0473202 0.3459904 -0.0351431 -0.0844086 0.2270084 1.0776982 -0.2586497 0.0180226 -0.2297868 0.2431206 0.2108839 0.2647344 -0.0720888 0.271399 0.2076568 -0.0569358 -0.0660877 -0.0509502 0.0748927 0.1831747 0.0000219 -0.0022146 -0.0270584 0.0542128 0.0272963 0.0088871 0.024915 0.1646516 0.2406273 -0.0008356 0.006479 0.0036328 0.1764629 0.0281123 0.0081883 0.0274796 0.3027661 -0.0124693 -0.0505756 -0.076313 -0.0337887 0.0748865 0.0386039 -0.1195187 -0.0093987 -0.0068336 0.066862 0.1171334 -0.0202233 0.0228314 -0.0390341 0.0338686 0.0006332 0.0260486 0.1211781 0.0201794 -0.0146603 0.0874578 0.0080942 0.0505125 -0.0698557 0.1227499 -0.0179564 -0.0162223 0.2253396 -0.0566428 0.0192515 -0.0385408 0.2527381 0.0109757 -0.1182293 -0.016017 0.3391558 0.3703164 0.0526524 0.0133876 0.3292487 0.2574513 -0.0022948 0.150889 0.0360142 0.0702739 0.2626616 -0.0772719 0.0785087 0.0042737 0.1375943 0.0603949 0.1036563 0.0069227 0.3029937 unknown
polarizability: 189.6998748|13.5626342|151.6030966|-15.2053915|-23.3187701|62.1317958 unknown
InChI: InChI=1S/C8H8N4O2/c1-4-2-5(8(14)12-10)6(3-9)7(13)11-4/h2,11-12H,10H2,1H3
charge 0 multiplicity 1
22 atoms
O  2.151757 -2.228021 0.639883
O  -1.856953 2.36507 -0.025287
N  2.535061 0.01495 0.125122
N  -2.642595 0.281431 0.565928
N  -3.9792 0.743629 0.447174
N  -1.392288 -2.68745 1.055231
C  -0.187296 0.616098 0.235362
C  2.141673 1.317523 -0.118731
C  0.786183 1.622833 -0.065564
C  0.240595 -0.70927 0.482444
C  1.669438 -1.076681 0.435207
C  3.22433 2.320857 -0.42777
C  -1.60923 1.138753 0.256515
C  -0.641264 -1.790991 0.79351
H  0.427889 2.635409 -0.255769
H  3.528608 -0.239937 0.091549
H  3.941958 2.406234 0.410015
H  2.787989 3.314864 -0.605888
H  3.795334 2.030298 -1.329829
H  -2.533157 -0.732621 0.653466
H  -4.466896 0.712832 1.352697
H  -3.949734 1.69289 0.042838
