program: Gaussian 09
title: 000227118
version: EM64L-G09RevD.01
frameworkgroup: C1[X(C14H20O3)]
method: RPBEPBE
basis: SDD
operation: Freq
keyword: #pfreq=noraman
keyword: PBEPBE/SDD
title: #p freq=noraman PBEPBE/SDD
converged: YES YES NO NO
title: Mulliken charges:
elementType: O O O C C C C C C C C C C C C C C H H H H H H H H H H H H H H H H H H H H
charge: -0.406187 -0.370773 -0.198247 -0.390745 -0.350784 -0.638057 -0.354631 0.434063 -0.355794 -0.544085 0.112595 -0.693773 0.242744 -0.569516 0.176582 0.089172 -0.802030 0.223738 0.208276 0.185672 0.195714 0.241839 0.204632 0.192881 0.189373 0.194793 0.196231 0.253315 0.217640 0.211132 0.210532 0.243584 0.366447 0.233455 0.232552 0.262859 0.354802
chargesum: 0.00000
title: Mulliken charges with hydrogens summed into heavy atoms:
elementType: O O O C C C C C C C C C C C C C C
charge: -0.039740 -0.015970 -0.198247 0.041268 0.030602 -0.191587 0.027624 0.434063 0.035231 -0.290770 0.112595 -0.054470 0.242744 -0.325932 0.176582 0.089172 -0.073164
polarizability: 2.27405472e+02 1.39450390e+01 1.71512581e+02 -2.09155139e+01 6.75790561e+00 1.11166316e+02
1716.lowfreq: -23.7844 -2.6100 0.0008 0.0009 0.0011 4.0624 15.1041 26.5707 28.1248
frequency: -11.2237 26.0092 28.0784 41.1201 63.2926 85.1425 111.5306 117.8699 135.0323 170.7104 183.7944 195.3536 226.7992 230.2340 245.7950 298.9275 313.7768 331.9135 348.3165 365.8261 386.0635 416.2734 419.1360 435.3846 462.2584 508.2682 537.6794 563.9424 602.3708 656.6640 698.8805 723.1277 726.6764 735.4246 736.0193 782.2332 813.8248 842.4012 874.1848 888.9175 906.5455 927.5434 975.9852 1008.7039 1011.3037 1019.9953 1030.7549 1064.3659 1075.6556 1080.2628 1114.5057 1123.3098 1140.5518 1151.7833 1191.3800 1220.3284 1227.1857 1238.4739 1266.5359 1276.6674 1278.5041 1285.9719 1291.9011 1298.2794 1299.1495 1323.3328 1347.8973 1354.0388 1364.5070 1388.5913 1408.7322 1418.7288 1452.0022 1462.6266 1464.7151 1469.1291 1472.1772 1477.3352 1478.0907 1486.3753 1493.0302 1504.9875 1567.7769 1602.3830 1638.5496 2931.4020 2949.6424 2955.8421 2965.0944 2968.9388 2973.2265 2982.7216 2988.1667 3002.6548 3017.3456 3030.2289 3044.6054 3069.6809 3069.7744 3073.1191 3121.3997 3138.4684 3151.3578 3531.7830 3579.1083
redmass: 1.9947 2.9543 4.6453 4.5168 3.2187 4.4407 1.8494 3.1047 2.4049 3.2439 1.1512 4.2524 3.8163 1.1636 3.8275 3.2029 4.6010 3.1662 5.1185 1.2842 4.3620 1.4348 2.3073 3.4292 2.7715 3.5007 6.0375 3.2566 3.6999 4.5438 6.2931 1.1392 3.7088 1.2829 2.1588 1.2657 3.0712 1.8419 1.2943 1.8940 1.4594 2.6696 1.2401 4.0585 3.2988 1.8155 2.4877 2.7988 1.4554 2.2367 2.4082 2.1421 2.1108 1.2898 1.6646 1.6490 1.2852 1.3741 2.1426 1.4200 1.3946 1.0926 1.2630 2.4874 1.3460 1.5446 1.4953 1.6556 1.2339 1.2155 4.9851 4.5595 1.1008 1.0699 1.0783 1.0507 1.0896 1.0494 1.0902 1.0932 1.1606 2.6856 6.6430 7.4372 6.8837 1.0687 1.0592 1.0590 1.0622 1.0611 1.0362 1.0372 1.0958 1.0988 1.0949 1.1012 1.1019 1.1007 1.0978 1.0993 1.0988 1.0917 1.0902 1.0656 1.0654
irintensity: 0.1835 1.0173 5.8696 0.2114 0.0509 0.0729 0.0366 0.0452 0.0379 0.3015 1.2172 2.1703 0.8378 0.0168 0.9198 1.1668 6.1837 26.1577 18.2962 72.5845 9.8028 89.0883 37.9047 8.5916 29.0238 21.8860 13.2919 0.2027 13.5604 2.8524 0.4088 7.4219 3.7545 0.3556 1.5350 0.2237 14.9760 31.7627 2.8850 8.3358 14.9863 21.6162 1.3825 7.5847 0.1356 2.7648 51.6206 0.0962 51.6712 0.2990 13.7041 246.3483 46.9913 84.7513 1.5340 175.1147 5.8027 5.4374 17.2842 41.5273 0.9837 1.7459 18.2538 54.4863 43.2928 7.4218 1.2647 0.7118 48.3985 11.2680 19.8828 0.1616 37.2493 0.0807 1.4198 19.1536 1.4619 12.8313 6.1951 4.4405 35.1244 26.3863 302.0956 76.6155 147.1782 31.2655 10.7884 4.7051 1.1335 120.8546 39.0616 6.2759 5.3370 2.9517 6.7304 15.7470 87.4903 83.7341 20.9726 53.5629 16.9102 7.1286 5.0005 27.2068 50.9928
temp: 298.150 k
press: 1.00000 atm
elementType: 8 8 8 6 6 6 6 6 6 6 6 6 6 6 6 6 6 1 1 1 1 1 1 1 1 1 1 1 1 1 1 1 1 1 1 1 1
symmnumber: 1
zpe: 810795.7 jmol-1
zpe.correction: 0.308816 hartree
zpe.thermalcorrener: 0.327030 hartree
zpe.thermalcorrenthalpy: 0.327974 hartree
zpe.thermalcorrgfe: 0.261094 hartree
zpe.sumelectzpe: -769.848490 hartree
zpe.sumelectthermal: -769.830276 hartree
zpe.sumelectthermalent: -769.829332 hartree
zpe.sumelectthermalfe: -769.896211 hartree
dipole: -5.7649 -0.9328 1.5797
dipole: 6.0497
quadrupole: -126.5577 -95.9779 -103.9962
quadrupole: -10.2242 1.7386 4.1579
quadrupole: -17.7138 12.8660 4.8477 -10.2242 1.7386 4.1579
hfenergy: -770.1573056 hartree
pointgroup: C01 [X(C14H20O3)]
dipole: 2.2660064 -0.4736947 -0.5530926 debye
polarizability: 227.2246947|-17.1726676|169.3013797|-18.3249288|-14.0006398|113.558295 unknown
InChI: InChI=1S/C14H20O3/c1-3-4-5-6-7-11-8-12(10(2)15)14(17)9-13(11)16/h8-9,16-17H,3-7H2,1-2H3
charge 0 multiplicity 1
37 atoms
O  0.129867 -2.788261 -0.003741
O  -4.213995 -0.995299 1.044764
O  -4.706835 1.596847 0.413686
C  2.159116 -0.029153 -0.014332
C  3.585919 0.143495 -0.58024
C  1.084924 -0.211544 -1.126016
C  4.65304 0.342678 0.519591
C  -0.320404 -0.420249 -0.582494
C  6.083647 0.515575 -0.040642
C  -1.274622 0.613839 -0.561412
C  -0.722062 -1.674612 -0.03652
C  7.141492 0.713144 1.066544
C  -2.590205 0.484431 -0.028788
C  -2.008609 -1.861057 0.498573
C  -2.941589 -0.799134 0.50988
C  -3.530984 1.648407 -0.05197
C  -3.032681 2.963352 -0.671958
H  1.890081 0.857804 0.59224
H  2.141401 -0.88919 0.687108
H  3.853971 -0.743078 -1.193764
H  3.603639 1.013529 -1.269507
H  1.095636 0.686378 -1.771875
H  1.388189 -1.050754 -1.791742
H  4.390151 1.231712 1.129834
H  4.63513 -0.524806 1.21215
H  6.346372 -0.3729 -0.650677
H  6.102366 1.383321 -0.731257
H  -0.978372 1.579637 -0.982989
H  8.155059 0.832933 0.641961
H  6.919441 1.613035 1.670597
H  7.162886 -0.153997 1.75331
H  -2.26767 -2.847131 0.902157
H  1.005137 -2.572085 -0.411474
H  -2.750453 2.833581 -1.733332
H  -2.153066 3.361396 -0.132421
H  -3.850263 3.697428 -0.608302
H  -4.305754 -1.928269 1.370158
