program: Gaussian 09
title: 000227114
version: EM64L-G09RevD.01
frameworkgroup: C1[X(C18H27NO)]
method: RPBEPBE
basis: SDD
operation: Freq
keyword: #p
keyword: freq=noraman
keyword: PBEPBE/SDD
title: #p freq=noraman PBEPBE/SDD
converged: YES YES NO NO
title: Mulliken charges:
elementType: O N C C C C C C C C C C C C C C C C C C H H H H H H H H H H H H H H H H H H H H H H H H H H H
charge: -0.241608 -0.158768 0.061304 -0.440145 -0.463951 -0.398314 -0.412090 -0.384459 -0.479194 -0.299678 0.300963 0.121104 0.118410 0.536502 -0.607387 -0.401460 -0.400470 -0.702727 -0.701143 -0.750637 0.172718 0.215727 0.189905 0.218197 0.210375 0.202215 0.191072 0.192277 0.201054 0.199082 0.193493 0.250202 0.196266 0.225429 0.192998 0.244687 0.245045 0.228189 0.205227 0.216139 0.221383 0.216151 0.204646 0.222253 0.218019 0.215998 0.215000
chargesum: 0.00000
title: Mulliken charges with hydrogens summed into heavy atoms:
elementType: O N C C C C C C C C C C C C C C C C C C
charge: -0.241608 -0.158768 0.234023 -0.034514 -0.035380 -0.005028 -0.018759 0.008117 -0.032725 0.118749 0.300963 0.121104 0.118410 0.536502 -0.362700 -0.156414 -0.172281 -0.059978 -0.058093 -0.101620
polarizability: 2.75949459e+02 5.72408154e+00 1.93989685e+02 -7.01378463e+00 5.68215664e+00 1.42737260e+02
1716.lowfreq: -12.7555 -10.0514 -2.6556 -0.0010 -0.0009 -0.0003 22.8620 25.9747 47.8255
frequency: 22.3980 25.8337 47.7864 55.8838 98.6750 117.2264 146.6548 175.4941 194.7122 200.0149 215.6635 223.1404 248.8344 264.1379 281.8361 305.2949 309.3945 317.9267 337.8218 346.6311 358.6185 416.5897 428.8671 431.4454 434.8497 441.6290 468.6541 473.9852 496.2934 531.2878 566.3958 602.7211 638.9377 697.9195 737.1134 744.1092 783.0841 788.8228 815.0179 828.9525 843.1137 864.6659 884.1646 890.6913 893.4764 909.1834 916.2732 925.3562 930.0306 939.5962 956.4953 958.6440 983.4064 994.1633 1019.3917 1026.1156 1045.9500 1051.8837 1056.9117 1077.4092 1096.9986 1111.4338 1115.5289 1119.4800 1145.3902 1164.6102 1189.4375 1202.9534 1205.1464 1213.9003 1219.6628 1226.3609 1245.1754 1254.7136 1262.8558 1270.6522 1275.4180 1289.4929 1302.3383 1316.2626 1329.7006 1334.6225 1341.7428 1345.6202 1345.9799 1369.7820 1373.9564 1374.1517 1377.9616 1393.2668 1403.4898 1418.1686 1458.0219 1460.4373 1461.6544 1463.7278 1464.6958 1465.5167 1466.5424 1471.0069 1475.5718 1478.0454 1480.3343 1486.2254 1492.6658 1499.3200 1591.4658 1624.1996 2812.1215 2818.1301 2849.6776 2966.1146 2966.7503 2969.9313 2970.0072 2971.3213 2974.2651 2976.5809 2987.4584 3028.9184 3030.9879 3038.0815 3042.2612 3050.2177 3051.8727 3065.0146 3065.5649 3067.7723 3074.3847 3077.3470 3080.4830 3123.7188 3127.9567 3132.6998 3161.7597
redmass: 3.2770 2.7510 3.5399 3.6850 3.6589 3.2763 2.9161 2.2678 2.0863 1.5560 3.6163 1.9437 1.0740 2.9469 3.3354 1.3401 2.0168 1.9356 2.5203 2.2274 2.3854 2.9964 3.1460 3.0610 3.2485 2.8796 1.9085 3.1777 3.2940 3.2160 4.3800 3.2340 4.9694 3.9831 3.6138 4.7087 1.7086 2.0809 2.9536 1.4653 2.5195 2.3455 1.9358 1.5955 1.4364 2.9852 1.7052 2.0652 1.6823 1.2108 1.4488 5.1854 2.3186 1.7543 1.4067 1.3798 2.0410 1.3366 1.8063 1.4742 2.4666 2.4980 2.0009 2.3327 2.3166 1.6296 1.5141 1.1879 2.9387 2.7106 2.3772 2.1922 1.4069 1.2610 1.2715 1.6213 1.4052 2.0611 1.2164 1.3708 1.3440 1.4206 1.4819 1.5670 1.5173 1.4254 1.2669 1.2306 4.7058 1.3828 1.2122 3.5830 1.0511 1.0949 1.1341 1.0880 1.0489 1.0889 1.0644 1.0858 1.1136 1.0946 1.0963 1.0547 1.4520 1.4136 7.0934 6.8431 1.0784 1.0735 1.0714 1.0633 1.0639 1.0614 1.0358 1.0347 1.0613 1.0358 1.0611 1.0968 1.0954 1.1005 1.1016 1.0915 1.0982 1.0999 1.0999 1.1004 1.0984 1.0995 1.0990 1.0901 1.0879 1.0895 1.0955
irintensity: 0.2394 0.0343 0.1390 0.0529 0.4307 1.0489 1.0716 0.9816 0.1162 0.2928 1.0171 0.3957 0.0102 1.1852 0.5634 0.1933 0.8453 1.5091 0.2089 3.7822 5.2014 2.5537 0.3532 2.0888 4.0862 2.8497 1.3817 0.7273 2.6464 0.7292 1.2455 7.9293 4.7873 3.2287 2.3448 5.0561 1.3405 6.5953 5.0542 38.4493 4.1362 47.6440 5.0092 0.9433 12.4174 23.1228 3.8469 2.7908 3.3697 0.3905 9.5700 107.7740 16.8731 1.8342 1.3754 0.1842 24.3233 0.7405 1.4662 8.4280 15.4769 3.1156 39.6244 104.8382 5.2982 27.5483 43.3968 24.2807 7.2835 2.5832 34.2981 72.3312 10.6604 4.4262 2.0377 30.6623 17.8422 16.4059 2.1318 0.5522 2.6142 2.6583 9.9190 2.5160 4.1019 24.4201 19.8503 17.3116 23.3254 1.4074 8.2890 12.2433 0.0096 3.8032 18.0439 8.5143 0.5000 6.5318 3.3575 19.6384 1.1606 23.6384 3.4528 11.8402 18.5699 108.7435 13.2556 5.6239 33.1282 94.6973 160.7780 28.4338 53.5089 41.1980 26.7687 35.1304 24.1632 36.2873 28.4186 68.6169 77.9488 14.5633 19.3494 62.7314 59.3297 4.2724 2.6740 22.5863 139.8948 33.6123 45.0588 26.7467 21.2450 10.4183 10.6058
temp: 298.150 k
press: 1.00000 atm
elementType: 8 7 6 6 6 6 6 6 6 6 6 6 6 6 6 6 6 6 6 6 1 1 1 1 1 1 1 1 1 1 1 1 1 1 1 1 1 1 1 1 1 1 1 1 1 1 1
symmnumber: 1
zpe: 1081093.1 jmol-1
zpe.correction: 0.411767 hartree
zpe.thermalcorrener: 0.431464 hartree
zpe.thermalcorrenthalpy: 0.432408 hartree
zpe.thermalcorrgfe: 0.363423 hartree
zpe.sumelectzpe: -830.531949 hartree
zpe.sumelectthermal: -830.512252 hartree
zpe.sumelectthermalent: -830.511308 hartree
zpe.sumelectthermalfe: -830.580293 hartree
dipole: 1.4334 -2.0373 -1.2705
dipole: 2.7963
quadrupole: -109.6488 -122.9344 -124.5078
quadrupole: 0.4890 -2.9986 -0.6957
quadrupole: 9.3816 -3.9041 -5.4775 0.4890 -2.9986 -0.6957
hfenergy: -830.9437156 hartree
pointgroup: C01 [X(C18H27N1O1)]
dipole: 0.5727218 0.8201262 0.4579111 debye
polarizability: 275.8063354|-6.263075|194.5716666|7.4558054|2.896909|142.2984026 unknown
InChI: InChI=1S/C18H27NO/c1-18(2,3)15-9-10-17-14(11-15)12-19(13-20-17)16-7-5-4-6-8-16/h9-11,16H,4-8,12-13H2,1-3H3
charge 0 multiplicity 1
47 atoms
O  0.315005 -2.376133 0.195496
N  1.751478 -0.419604 0.242092
C  3.159049 0.059964 0.424191
C  4.140656 -0.819567 -0.39718
C  3.315853 1.540285 -0.004908
C  5.60563 -0.344562 -0.24901
C  4.779139 2.025038 0.136935
C  5.758928 1.136382 -0.661499
C  0.662037 0.525556 0.589882
C  1.472914 -1.722818 0.842336
C  -0.695933 -0.124904 0.336838
C  -0.800926 -1.519259 0.114241
C  -4.434209 0.952542 -0.099212
C  -3.141718 0.105421 -0.018673
C  -1.873728 0.659083 0.274807
C  -2.049634 -2.103716 -0.198111
C  -3.198946 -1.29725 -0.26323
C  -5.471656 0.418845 0.934564
C  -5.036936 0.841784 -1.532586
C  -4.179623 2.451755 0.20346
H  3.456125 0.000201 1.506484
H  3.828135 -0.769421 -1.458614
H  4.072092 -1.881328 -0.094598
H  2.664331 2.193543 0.604898
H  2.98908 1.637349 -1.060484
H  6.266943 -0.98687 -0.86164
H  5.930551 -0.466403 0.805523
H  5.066799 2.011484 1.208938
H  4.851343 3.077859 -0.19779
H  6.800772 1.475935 -0.503413
H  5.546165 1.237547 -1.745609
H  0.743817 1.422003 -0.046967
H  0.728222 0.872327 1.655631
H  2.311247 -2.41566 0.696399
H  1.228154 -1.645803 1.933017
H  -1.778499 1.737152 0.447929
H  -2.096798 -3.182387 -0.377227
H  -4.157171 -1.771305 -0.505367
H  -6.410348 1.001669 0.872131
H  -5.719013 -0.642388 0.752986
H  -5.078222 0.502229 1.964329
H  -5.275889 -0.204819 -1.793145
H  -5.970479 1.431872 -1.603807
H  -4.32551 1.223123 -2.287808
H  -5.132557 3.008633 0.13903
H  -3.771942 2.600537 1.220687
H  -3.478928 2.903478 -0.523247
