program: Gaussian 09
title: 000227104
version: EM64L-G09RevD.01
frameworkgroup: C1[X(C18H21ClN2O4)]
method: RPBEPBE
basis: SDD
operation: Freq
keyword: #p
keyword: freq=noraman
keyword: PBEPBE/SDD
title: #p freq=noraman PBEPBE/SDD
converged: YES YES NO NO
title: Mulliken charges:
elementType: Cl O O O O N N C C C C C C C C C C C C C C C C C C H H H H H H H H H H H H H H H H H H H H H
charge: -0.020090 -0.287141 -0.277472 -0.269289 -0.282213 -0.457295 -0.128816 0.289260 0.183431 -0.060993 0.274639 -0.444080 0.235497 -0.779787 -0.087825 -0.759050 0.414831 0.159923 -0.466227 0.190977 -0.776296 -0.217558 -0.220722 -0.675054 -0.674517 0.394963 0.299531 0.246964 0.229091 0.246996 0.261696 0.222497 0.263707 0.244563 0.244553 0.229794 0.227806 0.228310 0.228774 0.228319 0.227201 0.227312 0.213927 0.213784 0.228061 0.228022
chargesum: 0.00000
title: Mulliken charges with hydrogens summed into heavy atoms:
elementType: Cl O O O O N N C C C C C C C C C C C C C C C C C C
charge: -0.020090 -0.287141 -0.277472 -0.269289 -0.282213 -0.062332 -0.128816 0.289260 0.183431 -0.060993 0.274639 -0.144549 0.235497 -0.056737 -0.087825 -0.011151 0.414831 0.159923 -0.466227 0.190977 -0.057386 0.238558 0.236370 -0.006615 -0.004650
polarizability: 5.17746192e+02 2.03366736e+01 2.82136967e+02 -1.49625729e-01 2.37255235e-01 1.22083483e+02
1716.lowfreq: -5.8040 -2.1263 -0.0018 -0.0013 -0.0004 2.0971 19.2175 21.2148 40.0810
frequency: 19.1745 21.1948 40.0523 42.5730 45.7856 68.4634 69.8466 76.2359 83.7666 87.0303 91.5894 94.8716 97.8680 113.4288 129.8601 140.4277 155.3090 166.6400 179.1172 223.1113 237.9864 241.8488 243.6365 259.5495 260.8384 267.1313 282.3315 302.5810 314.3246 339.9383 350.2000 372.3809 385.3067 394.5409 413.7427 467.2827 473.2569 556.9162 588.6479 598.3282 634.5374 647.6856 659.7017 670.6366 701.1736 713.4685 745.8943 751.2499 771.5352 778.5829 798.1093 798.7834 819.6146 831.6652 858.7526 884.1637 949.3728 971.5927 979.0539 996.4563 1015.8318 1025.1233 1031.0395 1033.3114 1035.8679 1041.1109 1042.5390 1056.3064 1069.9438 1105.5375 1111.5238 1112.5689 1135.1924 1135.9830 1170.8553 1237.8553 1247.6749 1249.1728 1263.7767 1275.9977 1305.0123 1342.0435 1350.0216 1363.0987 1384.9768 1390.7043 1398.8136 1401.7604 1402.5858 1405.9974 1408.9092 1436.7181 1442.5045 1449.9348 1452.5922 1459.1884 1463.6350 1464.3024 1466.1411 1468.1465 1473.4099 1473.6682 1484.4877 1486.3996 1491.1992 1511.3478 1524.6924 1547.0781 1593.2274 1605.5219 1630.6089 2991.1574 2993.9599 2994.2639 2994.4960 2995.9813 3008.3702 3008.7426 3065.7461 3066.5564 3070.1504 3071.5874 3077.8613 3090.4672 3090.9793 3099.5602 3099.8036 3103.6949 3104.5736 3105.3432 3142.7113 3157.8947
redmass: 3.6124 3.7457 3.1629 4.9880 3.1300 3.3765 3.5044 3.5769 4.4218 1.7218 4.6949 1.3438 1.4376 1.0739 2.6066 2.8192 5.6072 3.8882 5.3077 3.6306 1.4542 5.2284 1.5660 3.2495 2.4389 2.9954 3.9656 4.8660 5.5590 5.6539 9.2812 5.8953 3.7956 3.9994 4.8375 4.2953 9.1893 3.9187 5.0506 5.0827 5.9383 7.0238 4.9648 8.9407 4.9649 4.9063 7.0597 7.8688 8.0795 6.5999 1.1068 1.1081 3.8767 3.7659 5.2526 3.3401 1.3750 1.1067 1.7827 3.1956 2.2636 2.0928 1.4771 2.6653 1.5127 1.5021 4.2858 2.1498 6.3887 3.0935 2.2364 2.2939 1.4643 1.4693 5.8115 4.4737 1.1350 1.1315 1.8844 3.7453 2.9633 1.6764 1.5509 2.3174 5.0900 2.7753 1.2798 1.4642 1.2023 1.2022 1.2892 2.2655 1.0461 1.8723 1.0463 1.0457 1.0408 1.0404 1.5337 1.1224 1.0771 1.0812 1.3782 1.0834 1.8797 6.3703 4.3699 4.4855 11.1634 10.9796 7.8966 1.0366 1.0362 1.0363 1.0358 1.0367 1.0581 1.0581 1.1063 1.1064 1.0965 1.0961 1.0957 1.0985 1.0986 1.1003 1.1001 1.1016 1.1026 1.1026 1.0910 1.0912
irintensity: 0.1301 0.6427 0.0002 0.3590 0.0045 1.7558 0.6347 0.9247 0.3318 0.6337 1.0157 0.8579 0.0643 0.0021 12.2174 0.1249 1.9202 0.4669 2.7842 4.2944 2.2173 5.2728 0.0866 1.5591 2.4290 0.9467 0.5377 0.1144 16.2935 19.0431 20.3041 1.2227 1.6079 2.3859 1.2703 1.2032 12.4418 2.1450 34.2977 1.0797 1.9619 8.3748 36.4419 2.4057 1.3793 30.0009 3.9301 5.3835 20.4963 1.5923 2.8189 3.2141 55.4492 1.6921 25.4324 6.2007 21.1510 49.5498 26.1518 352.8279 47.3999 60.9324 5.2664 443.9489 0.1781 21.0616 508.4972 150.6665 108.9475 76.5955 3.9767 3.2398 5.1477 5.1378 147.3422 61.5448 0.0026 0.0025 56.0788 662.5190 176.4769 306.1019 8.9400 101.1921 70.5830 319.6939 27.3094 13.4532 11.5097 18.6126 18.3410 136.7405 17.5129 89.9923 10.7061 11.1076 14.7250 16.3772 69.8923 52.4629 9.3371 17.5455 29.3129 12.9384 35.0744 57.9801 28.9056 22.8181 468.1926 404.5518 439.8083 21.5186 2.5435 35.5438 27.2165 5.6204 28.3204 18.4862 6.5909 5.9862 11.9360 9.6650 4.1546 41.4943 32.5161 12.1434 13.2446 9.2410 44.6394 46.1766 279.8196 6.0150
temp: 298.150 k
press: 1.00000 atm
elementType: 17 8 8 8 8 7 7 6 6 6 6 6 6 6 6 6 6 6 6 6 6 6 6 6 6 1 1 1 1 1 1 1 1 1 1 1 1 1 1 1 1 1 1 1 1 1
symmnumber: 1
zpe: 939481.2 jmol-1
zpe.correction: 0.357829 hartree
zpe.thermalcorrener: 0.385115 hartree
zpe.thermalcorrenthalpy: 0.386059 hartree
zpe.thermalcorrgfe: 0.296941 hartree
zpe.sumelectzpe: -1567.160830 hartree
zpe.sumelectthermal: -1567.133545 hartree
zpe.sumelectthermalent: -1567.132601 hartree
zpe.sumelectthermalfe: -1567.221718 hartree
dipole: 0.1973 -2.6934 0.0224
dipole: 2.7007
quadrupole: -126.9486 -149.9523 -153.8901
quadrupole: 0.4236 0.0189 -0.0578
quadrupole: 16.6484 -6.3553 -10.2931 0.4236 0.0189 -0.0578
hfenergy: -1567.5186595 hartree
pointgroup: C01 [X(C18H21Cl1N2O4)]
dipole: 0.0581459 -1.0607807 -0.019344 debye
polarizability: 517.7260898|15.5874249|281.2977705|16.7984244|5.4820174|122.9427816 unknown
InChI: InChI=1S/C18H21ClN2O4/c1-6-24-17(22)14-9(3)12(20-11(14)5)8-13-15(18(23)25-7-2)10(4)16(19)21-13/h8,20H,6-7H2,1-5H3
charge 0 multiplicity 1
46 atoms
Cl 3.177607 3.781053 0.405418
O  -5.217039 -0.922275 -0.081711
O  4.635312 -1.789665 0.298152
O  -5.519333 1.391061 -0.022926
O  2.456025 -2.606136 0.176501
N  -1.240713 1.43753 0.14627
N  1.42675 1.6744 0.263041
C  -1.024247 0.041455 0.114465
C  -2.306815 -0.591764 0.044785
C  -3.276697 0.465514 0.036553
C  -2.571733 1.720498 0.101409
C  0.280754 -0.506699 0.150121
C  1.458019 0.252691 0.220365
C  -2.539375 -2.074952 -0.007619
C  2.847123 -0.20672 0.265513
C  -3.099454 3.120685 0.122304
C  3.665108 0.947225 0.337451
C  -4.740366 0.397544 -0.023037
C  2.713184 2.042655 0.330123
C  3.244789 -1.620934 0.240813
C  5.157391 1.082313 0.407163
C  -6.703281 -1.062769 -0.13966
C  5.112836 -3.205895 0.279342
C  -7.003895 -2.556782 -0.208589
C  6.634737 -3.157502 0.369641
H  -0.399871 2.058497 0.19852
H  0.401997 -1.594343 0.123376
H  -3.091527 -2.355305 -0.922117
H  -1.590508 -2.635788 0.018238
H  -3.169553 -2.405296 0.836957
H  -3.756428 3.27717 0.996079
H  -2.277026 3.855305 0.148714
H  -3.734499 3.311223 -0.7602
H  5.561804 0.560943 1.292783
H  5.639959 0.615787 -0.46993
H  5.450951 2.14429 0.452887
H  -7.133742 -0.585468 0.759426
H  -7.072148 -0.515151 -1.025793
H  4.653387 -3.740177 1.130618
H  4.757816 -3.680481 -0.653422
H  -6.610112 -3.080886 0.679237
H  -6.554978 -3.009927 -1.10922
H  -8.097003 -2.715824 -0.248643
H  7.043141 -4.184478 0.355103
H  7.063384 -2.601818 -0.482022
H  6.959668 -2.668404 1.304018
