program: Gaussian 09
title: 000227101
version: EM64L-G09RevD.01
frameworkgroup: C1[X(C23H32O5)]
method: RPBEPBE
basis: SDD
operation: Freq
keyword: #pfreq=noraman
keyword: PBEPBE/SDD
title: #p freq=noraman PBEPBE/SDD
converged: NO YES NO NO
title: Mulliken charges:
elementType: O O O O O C C C C C C C C C C C C C C C C C C C C C C C H H H H H H H H H H H H H H H H H H H H H H H H H H H H H H H H
charge: -0.285582 -0.193820 -0.202106 -0.273094 -0.253282 0.287453 -0.147461 0.232628 -0.174310 -0.131808 -0.558511 -0.289903 0.395117 -0.660043 -0.012564 -0.501345 0.134818 -0.814986 -0.506346 0.083504 -0.528103 -0.554592 -0.865179 -0.476971 0.024426 -0.767286 0.285874 -0.763792 0.262271 0.238670 0.260735 0.228370 0.241697 0.224499 0.245981 0.276651 0.189487 0.215525 0.205230 0.213654 0.281422 0.238989 0.200943 0.214164 0.198970 0.269168 0.204274 0.223240 0.210198 0.270509 0.222852 0.217359 0.231642 0.236969 0.232192 0.271754 0.252710 0.247045 0.246164 0.243925
chargesum: 0.00000
title: Mulliken charges with hydrogens summed into heavy atoms:
elementType: O O O O O C C C C C C C C C C C C C C C C C C C C C C C
charge: -0.285582 -0.193820 -0.202106 -0.273094 -0.253282 0.287453 0.114811 0.232628 0.064360 0.128928 -0.088445 -0.065404 0.395117 -0.137410 0.176923 -0.080590 0.134818 -0.080922 -0.091239 0.083504 -0.059964 -0.127077 -0.161621 -0.027969 0.261395 -0.010630 0.285874 -0.026658
polarizability: 3.22235300e+02 -2.98522270e+00 2.31007268e+02 6.04116692e+00 -2.49379219e+00 1.96768555e+02
1716.lowfreq: -16.4031 -11.4730 -2.5624 -0.0010 -0.0007 -0.0004 2.3208 23.0267 27.4678
frequency: -15.2180 22.9794 27.1562 33.9933 57.3561 60.4605 64.4161 86.8716 93.9134 114.1837 122.9659 142.9965 152.5085 159.4864 186.8490 194.3656 196.7419 219.8537 240.2040 251.3549 262.5962 269.7133 278.1618 292.3111 305.0523 316.4155 318.3925 340.7512 361.0951 376.6878 390.7217 402.0868 413.9929 430.4048 436.9806 456.1803 459.4131 473.2312 492.0631 504.7769 519.2137 531.2557 556.6889 567.5832 574.8400 598.1000 614.5179 631.4954 637.9879 675.2079 703.2590 726.9378 773.3006 792.2508 792.9658 804.5139 826.6367 831.5469 854.7881 879.4930 891.0850 904.0412 916.0905 921.5536 937.8005 940.9897 943.4967 956.5807 966.2574 970.8904 984.5325 997.8174 999.3276 1009.2479 1014.5028 1026.4133 1029.0944 1041.0243 1042.9831 1048.4842 1061.7014 1075.6486 1085.1022 1105.6071 1113.0060 1119.8825 1131.4699 1140.8730 1143.9913 1147.8178 1164.4620 1170.8524 1185.2177 1189.8976 1202.9914 1205.4437 1210.1763 1221.2197 1236.7566 1244.2560 1250.2044 1252.7366 1259.7543 1270.2388 1282.3228 1284.2838 1295.5412 1300.7404 1308.9397 1315.5626 1322.4384 1328.6115 1336.3466 1338.0377 1346.0930 1349.6845 1351.7097 1358.6808 1359.4406 1370.7013 1371.6703 1382.2220 1388.8497 1396.9968 1435.9250 1449.0542 1449.8374 1453.3581 1455.0271 1457.2151 1460.9041 1464.5220 1466.3114 1473.2704 1473.3759 1484.2097 1493.2292 1497.6762 1500.4292 1609.0291 1614.1694 1642.8413 2893.9952 2908.8462 2949.1234 2953.9194 2972.1547 2972.6573 2982.8221 2989.9944 2990.8848 2993.0239 2993.3584 2995.8985 3000.1215 3000.5369 3005.8323 3007.9693 3017.9824 3030.0146 3049.9283 3061.7712 3065.2363 3075.8366 3077.0404 3077.6961 3078.6515 3084.2221 3096.9643 3099.3300 3108.2924 3128.0600 3129.6405 3140.4665
redmass: 1.0635 5.4390 1.8638 6.2368 4.5466 3.8476 3.6144 2.0302 3.0185 5.3348 3.8393 3.5044 1.8350 4.8753 3.0815 2.6784 2.2849 2.5696 2.6840 2.1817 1.8804 2.6402 2.6843 3.4416 2.5995 3.2205 3.1897 3.5540 2.8681 2.9749 3.3183 2.8305 3.0887 3.1599 3.4295 4.1167 2.4906 3.5435 3.8742 3.1693 2.9691 3.0012 3.2937 3.1472 3.2516 2.9086 3.3296 3.4108 3.8979 3.9640 4.0078 3.2308 3.3473 2.6763 5.2850 1.8814 3.3413 2.6827 3.4494 1.9168 1.9025 2.8738 1.9370 2.3640 2.1165 2.5232 1.7959 2.0796 1.7146 2.0397 1.9327 1.9923 2.0849 1.7798 1.7424 1.8948 2.1033 1.6649 1.6904 2.6673 1.5689 1.9998 2.7311 1.8442 2.4658 1.8544 1.4769 1.7456 2.2956 1.6390 2.3536 1.7331 2.2602 2.2204 2.1728 3.2194 1.9199 1.5197 1.4790 1.7136 1.6620 1.7694 1.5123 1.3797 1.5355 1.6895 1.4835 2.4108 1.4682 1.3755 1.2753 1.3923 1.3806 2.5346 1.4991 1.5784 1.4239 1.4440 1.4660 1.3488 1.3464 1.2564 1.2288 1.1899 1.0727 1.0634 1.0854 1.0617 1.0508 1.0924 1.0854 1.0860 1.0755 1.0852 1.0547 1.0933 1.0618 1.0594 1.0596 8.2019 9.1365 9.3492 1.0793 1.0811 1.0627 1.0694 1.0687 1.0719 1.0632 1.0463 1.0503 1.0370 1.0620 1.0607 1.0633 1.0661 1.0379 1.0774 1.0962 1.1013 1.1011 1.1018 1.1007 1.0934 1.0951 1.0986 1.0949 1.0979 1.0956 1.0987 1.0977 1.0927 1.1014 1.1017
irintensity: 1.0752 0.1301 4.0618 0.5349 1.3755 1.0057 0.9319 0.6478 1.7612 3.9909 4.4119 1.1861 0.2869 0.3224 1.5391 1.8726 0.5880 7.2376 5.3472 4.1679 1.1263 0.6180 0.9135 4.6862 1.3925 2.7912 0.2881 2.8605 1.3455 2.5961 0.4575 2.4838 0.9920 2.1853 1.4397 7.1925 5.3398 1.8125 0.8470 9.6784 12.0952 5.8436 6.3788 2.4167 0.3841 3.8274 1.7522 22.3792 7.4148 1.7317 2.5295 0.9124 0.8873 1.5182 19.3198 3.3769 6.2425 0.4242 12.3396 1.9424 6.1120 44.7938 18.2040 5.3710 35.9945 13.9942 11.2525 7.2244 17.3769 4.3401 0.8599 139.6196 42.1123 8.5853 1.1740 8.2029 9.2618 8.3890 15.6304 1.6741 7.5831 5.9608 1.3511 14.3788 25.0410 22.3739 7.6664 5.8679 12.4497 11.2529 1.5186 9.7274 3.7222 4.4710 20.7473 413.0335 18.9284 4.9964 13.4350 6.9906 14.2417 2.1531 3.3835 5.0804 2.8491 27.3219 6.5227 32.3708 23.0795 5.8785 0.2776 2.2810 1.0049 52.4415 2.0000 0.6499 5.4861 1.0591 15.5941 34.8991 48.2214 55.3929 22.1424 37.8209 25.5533 21.8395 12.0334 24.8187 19.2455 8.8358 4.4863 4.8123 8.2525 18.5095 7.4764 7.2609 3.3774 3.0227 18.4631 130.1965 99.0615 182.3547 7.5620 24.1812 28.0347 33.0662 21.9990 10.4462 11.2415 3.6995 10.3433 3.4657 35.1045 23.7000 14.3771 17.3111 2.1766 28.4881 47.7898 54.9624 37.3967 40.2349 19.8769 12.8497 4.3192 42.9640 39.2558 6.7186 9.5903 9.0627 3.3625 29.6086 11.9788 11.8443
temp: 298.150 k
press: 1.00000 atm
elementType: 8 8 8 8 8 6 6 6 6 6 6 6 6 6 6 6 6 6 6 6 6 6 6 6 6 6 6 6 1 1 1 1 1 1 1 1 1 1 1 1 1 1 1 1 1 1 1 1 1 1 1 1 1 1 1 1 1 1 1 1
symmnumber: 1
zpe: 1329262.4 jmol-1
zpe.correction: 0.506289 hartree
zpe.thermalcorrener: 0.533058 hartree
zpe.thermalcorrenthalpy: 0.534002 hartree
zpe.thermalcorrgfe: 0.449761 hartree
zpe.sumelectzpe: -1269.600842 hartree
zpe.sumelectthermal: -1269.574073 hartree
zpe.sumelectthermalent: -1269.573129 hartree
zpe.sumelectthermalfe: -1269.657370 hartree
dipole: -2.0334 5.8101 1.3419
dipole: 6.3002
quadrupole: -158.9052 -176.0794 -175.3281
quadrupole: -10.9572 12.3015 3.8351
quadrupole: 11.1990 -5.9752 -5.2239 -10.9572 12.3015 3.8351
hfenergy: -1270.107131 hartree
pointgroup: C01 [X(C23H32O5)]
dipole: -0.8692429 -2.3147377 -0.1741248 debye
polarizability: 321.840459|-0.6542477|229.5660635|-9.8984316|-7.0215086|198.6045991 unknown
InChI: InChI=1S/C23H32O5/c1-12(24)23-19(28-23)10-17-16-6-5-14-9-15(27-13(2)25)7-8-21(14,3)20(16)18(26)11-22(17,23)4/h14-17,19-20H,5-11H2,1-4H3
charge 0 multiplicity 1
60 atoms
O  -4.364192 -0.350881 1.892155
O  -0.277501 2.490032 -1.020295
O  -5.399201 2.188294 -0.518026
O  5.834584 -0.256864 -0.287062
O  6.633569 0.944051 1.551859
C  -2.977811 0.433594 -0.156246
C  -2.217967 -0.836444 0.361109
C  -4.372344 0.246656 0.480688
C  -4.557634 -1.246476 0.697338
C  -0.839669 -1.014433 -0.296107
C  -3.273751 -1.974587 0.294021
C  0.033314 0.263587 0.025973
C  1.496753 0.174669 -0.537646
C  -2.16491 1.680856 0.271785
C  2.131503 -1.143681 0.047916
C  -0.129354 -2.294088 0.207013
C  -0.745108 1.561415 -0.307083
C  -3.170936 0.430506 -1.701262
C  1.319806 -2.40793 -0.30987
C  -5.520017 1.209807 0.270718
C  2.346074 1.371175 0.006047
C  3.629713 -1.289713 -0.316755
C  1.492965 0.185838 -2.091566
C  3.855114 1.24968 -0.319923
C  4.42147 -0.081936 0.196877
C  -6.787049 0.984901 1.079144
C  6.845624 0.327278 0.481715
C  8.194878 0.115563 -0.172718
H  -2.035442 -0.664939 1.442248
H  -5.536523 -1.736724 0.653774
H  -0.956284 -1.097094 -1.39473
H  -3.38812 -2.392836 -0.72485
H  -3.048208 -2.807975 0.982435
H  0.11889 0.272503 1.14064
H  -2.112592 1.721119 1.378628
H  -2.615918 2.616268 -0.099212
H  2.079894 -1.036748 1.157672
H  -0.714008 -3.184006 -0.098942
H  -0.118988 -2.284185 1.318217
H  -3.686966 -0.483067 -2.048941
H  -3.770891 1.302884 -2.004822
H  -2.201163 0.491735 -2.225244
H  1.806173 -3.297366 0.137639
H  1.324325 -2.56802 -1.406614
H  2.219193 1.423719 1.109303
H  1.960294 2.31757 -0.40719
H  4.033819 -2.216988 0.133196
H  3.762664 -1.380648 -1.411492
H  0.865678 -0.617998 -2.516356
H  1.104872 1.151352 -2.455598
H  2.508604 0.052263 -2.501313
H  4.017607 1.310137 -1.412529
H  4.403773 2.090816 0.141586
H  4.44916 -0.069572 1.304328
H  -7.189941 -0.033208 0.924891
H  -6.563644 1.070815 2.157566
H  -7.541775 1.730453 0.786596
H  8.297655 0.797941 -1.036002
H  8.286588 -0.915016 -0.552367
H  8.996051 0.331849 0.549083
