program: Gaussian 09
title: 000227100
version: EM64L-G09RevD.01
frameworkgroup: C1[X(C21H32O4)]
method: RPBEPBE
basis: SDD
operation: Freq
keyword: #pfreq=noraman
keyword: PBEPBE/SDD
title: #p freq=noraman PBEPBE/SDD
converged: YES YES NO NO
title: Mulliken charges:
elementType: O O O O C C C C C C C C C C C C C C C C C C C C C H H H H H H H H H H H H H H H H H H H H H H H H H H H H H H H H
charge: -0.438232 -0.194226 -0.448899 -0.198633 0.357889 -0.296966 -0.086354 0.440512 -0.137903 -0.156193 -0.522997 -0.514234 -0.525605 -0.546495 -0.519142 0.165140 -0.662531 0.149157 -0.488225 -0.878289 -0.482699 -0.088064 -0.843829 0.118918 -0.785653 0.230306 0.244635 0.243589 0.289080 0.216955 0.211468 0.200609 0.217221 0.194870 0.259870 0.226572 0.214354 0.228578 0.224074 0.231524 0.250881 0.231544 0.246888 0.227742 0.219467 0.268247 0.225236 0.187232 0.202599 0.222393 0.224453 0.221873 0.337142 0.330436 0.265749 0.232312 0.255656
chargesum: 0.00000
title: Mulliken charges with hydrogens summed into heavy atoms:
elementType: O O O O C C C C C C C C C C C C C C C C C C C C C
charge: -0.101090 -0.194226 -0.118463 -0.198633 0.357889 -0.066660 0.158281 0.440512 0.105686 0.132887 -0.094575 -0.096404 -0.070865 -0.105569 -0.066490 0.165140 -0.180126 0.149157 -0.009794 -0.162833 -0.070232 0.114534 -0.175110 0.118918 -0.031937
polarizability: 2.81336187e+02 2.54879168e+00 2.13358653e+02 3.47315704e+00 -8.92029664e-01 1.84545677e+02
1716.lowfreq: -24.2603 -12.1287 -8.3491 -0.0008 -0.0004 0.0002 21.0718 25.8688 34.9362
frequency: 20.4257 25.1947 34.7088 71.5543 82.1166 98.5160 117.4276 127.1755 142.7080 152.5630 172.3455 182.9643 192.6637 198.5050 210.0665 246.5587 252.8536 266.0005 279.0337 293.3934 299.7902 316.5173 323.5325 341.9030 349.4697 356.2713 371.8341 373.0567 380.4897 398.5257 416.5708 431.1554 449.3417 458.2455 460.4007 471.2671 489.3631 493.1170 528.4253 542.8459 571.4127 584.2508 593.6817 617.2755 633.9427 660.3603 717.1581 755.7393 778.9659 797.5257 811.9007 817.0728 847.6512 858.4777 876.1416 893.4865 897.2941 916.9634 925.3739 932.0840 938.1218 947.9211 952.6931 968.3945 985.7151 989.5923 992.2660 997.8166 1011.3685 1015.2809 1025.1168 1027.1315 1038.3983 1062.5040 1067.9226 1086.5214 1100.8213 1109.0489 1124.5714 1127.0360 1138.5142 1139.2322 1150.6148 1161.5206 1172.6010 1180.4757 1187.9084 1198.8421 1203.1815 1205.6379 1215.4922 1224.0290 1236.3933 1245.8810 1258.5825 1260.1043 1268.2191 1271.2418 1277.2323 1284.4382 1298.7000 1302.1407 1308.3921 1310.5311 1316.4740 1322.0191 1327.8018 1333.0060 1338.7564 1342.3053 1350.4786 1356.4286 1360.9186 1369.9719 1387.6898 1392.0568 1398.1208 1434.6403 1447.1003 1449.3003 1452.6735 1458.6503 1464.6667 1470.1381 1473.2050 1476.4662 1484.9694 1492.6151 1496.8788 1500.7692 1505.5302 1617.7272 1620.6430 2935.8196 2936.9071 2944.6028 2962.6174 2964.5900 2969.3566 2970.5831 2976.0756 2978.3209 2981.3017 2981.6079 2984.5933 2990.9007 2992.7072 3005.6060 3017.6644 3020.0598 3033.7577 3034.3255 3048.7130 3058.5760 3063.3702 3065.9160 3067.7077 3070.1537 3086.4651 3088.4096 3091.7281 3102.1349 3127.1578 3542.7159 3548.9657
redmass: 3.8593 4.5033 4.6988 3.7673 4.5885 2.9975 3.3388 2.0854 3.1188 1.0725 2.1123 1.8299 3.4247 3.7866 1.7766 3.1674 3.4760 2.8181 2.5971 1.7560 3.1389 1.7031 3.2600 2.6996 2.2455 1.5379 1.9754 2.8699 2.8345 2.7732 3.7643 2.7396 2.5756 3.0834 3.3412 2.0122 3.0324 3.2738 4.5578 2.8925 2.9583 3.4005 3.0768 2.8361 2.6048 3.6353 2.6476 2.7508 2.6788 2.1559 2.0211 2.5424 2.2059 2.2256 1.9230 2.7772 2.1482 2.4930 2.3051 1.9968 1.9785 1.8756 1.8585 1.9686 2.6741 2.0810 1.9453 2.2026 1.9430 2.1892 2.2401 2.0796 1.7666 2.4085 1.8407 1.9976 2.2224 2.0583 1.6965 1.8374 1.9601 2.6994 1.8300 2.0448 1.9609 1.8703 1.8013 2.0164 2.0257 1.9776 1.5139 1.6555 1.5741 1.4849 1.4609 1.4002 1.6771 1.3492 1.3395 1.4304 1.4209 1.3706 1.4647 1.3019 1.3096 1.3798 1.3698 1.3289 1.4426 1.4252 1.4020 1.4664 1.6194 1.2365 1.2516 1.2115 1.4875 1.0711 1.0930 1.0592 1.0827 1.0764 1.0740 1.0753 1.0949 1.0692 1.0815 1.0684 1.0611 1.0599 1.0643 8.5430 9.0849 1.0813 1.0775 1.0836 1.0644 1.0693 1.0718 1.0648 1.0615 1.0645 1.0498 1.0667 1.0498 1.0576 1.0636 1.0392 1.0985 1.0611 1.1002 1.0974 1.0997 1.0993 1.1004 1.0951 1.0952 1.0897 1.0975 1.1050 1.0970 1.0985 1.1023 1.0657 1.0660
irintensity: 1.6107 2.4226 0.6150 0.3609 0.9717 1.2330 4.6142 2.8065 0.4607 0.1209 0.6740 3.3797 2.9474 4.1308 0.1483 1.9347 3.5492 1.5093 1.5099 80.7692 3.2982 68.8429 3.3882 1.3046 2.2131 115.0570 94.6000 4.0358 4.3637 5.5210 5.8527 0.5267 0.5014 1.4778 11.6989 3.0418 0.6359 2.0974 0.7578 13.2225 8.5504 14.7522 1.9486 2.9726 3.7979 2.6948 6.5945 2.8717 7.5631 2.3996 2.0028 8.9353 7.0393 1.2510 0.5842 0.9932 3.9460 17.4737 24.2374 59.8365 11.3770 2.0573 0.7527 7.0427 37.5743 1.8976 11.0958 30.1074 20.5856 5.1813 12.9508 10.0413 36.4704 17.2583 23.2220 12.0095 5.0236 0.5874 11.7431 3.0188 3.3131 4.7322 9.4321 7.8953 8.0889 4.0635 28.7386 58.6139 18.4277 5.7846 47.5143 22.1541 14.8086 8.1980 5.2308 14.0876 37.2541 15.8933 14.5875 17.3759 15.9280 2.4261 7.6433 1.7512 4.5095 9.0649 0.8383 1.0821 1.0560 1.0924 10.9095 21.1862 1.0525 69.6669 36.8960 12.5970 10.7561 25.6838 8.0953 26.1948 2.8303 1.8721 2.5867 16.7432 6.8164 9.5462 12.0335 10.4025 10.6191 11.9845 0.8709 48.5083 165.7996 6.5058 6.8865 40.5994 9.6118 15.4554 13.3037 46.1756 19.5251 49.7374 3.4185 2.0542 54.0773 37.9175 26.8008 21.0908 25.5480 24.1882 18.5344 56.8184 68.8708 16.4625 22.0824 39.7957 24.6152 9.9312 35.7240 17.6132 39.7542 9.8826 9.7838 3.7962 1.9131
temp: 298.150 k
press: 1.00000 atm
elementType: 8 8 8 8 6 6 6 6 6 6 6 6 6 6 6 6 6 6 6 6 6 6 6 6 6 1 1 1 1 1 1 1 1 1 1 1 1 1 1 1 1 1 1 1 1 1 1 1 1 1 1 1 1 1 1 1 1
symmnumber: 1
zpe: 1292321.1 jmol-1
zpe.correction: 0.492219 hartree
zpe.thermalcorrener: 0.517070 hartree
zpe.thermalcorrenthalpy: 0.518014 hartree
zpe.thermalcorrgfe: 0.438993 hartree
zpe.sumelectzpe: -1118.367392 hartree
zpe.sumelectthermal: -1118.342541 hartree
zpe.sumelectthermalent: -1118.341597 hartree
zpe.sumelectthermalfe: -1118.420618 hartree
dipole: 1.6038 1.3428 3.7991
dipole: 4.3369
quadrupole: -155.5343 -154.2272 -156.4363
quadrupole: 5.2345 1.3507 -9.6399
quadrupole: -0.1350 1.1720 -1.0370 5.2345 1.3507 -9.6399
hfenergy: -1118.8596109 hartree
pointgroup: C01 [X(C21H32O4)]
dipole: -0.637181 0.5923249 -1.4678162 debye
polarizability: 281.2782571|-3.9278513|213.3849775|2.2847191|1.8849306|184.5772822 unknown
InChI: InChI=1S/C21H32O4/c1-12(22)21(25)9-6-14-15-5-7-19(2)11-13(23)4-8-20(19,3)18(15)17(24)10-16(14)21/h13-16,18,23,25H,4-11H2,1-3H3
charge 0 multiplicity 1
57 atoms
O  -4.071452 0.26721 -1.722845
O  0.045795 -2.585234 0.330345
O  6.392901 -0.422338 0.121986
O  -4.758378 -0.781042 1.715622
C  2.069482 -0.398568 0.196888
C  0.568811 -0.217971 -0.227146
C  -0.138398 0.983687 0.523256
C  2.836226 0.967138 -0.113831
C  -1.566391 1.166695 -0.031566
C  -2.401535 -0.121112 0.127421
C  0.68578 2.293207 0.417677
C  2.193685 2.117758 0.712705
C  2.754422 -1.544417 -0.618111
C  4.337776 0.820507 0.275481
C  -2.482784 2.221305 0.628651
C  -3.848127 0.309771 -0.261292
C  -1.76688 -1.297545 -0.640875
C  -0.324274 -1.474265 -0.135018
C  -3.90746 1.834855 0.127198
C  2.134224 -0.771239 1.711168
C  4.270541 -1.665575 -0.310321
C  5.035412 -0.333283 -0.462766
C  2.780243 1.367899 -1.62308
C  -4.932966 -0.490223 0.501366
C  -6.201381 -0.870266 -0.244346
H  0.546369 0.047989 -1.308595
H  -0.226402 0.709564 1.595696
H  -1.494807 1.400946 -1.117488
H  -2.447444 -0.383764 1.20544
H  0.259038 3.037759 1.117966
H  0.549478 2.717172 -0.597941
H  2.722671 3.066475 0.488584
H  2.346267 1.927359 1.792561
H  2.603632 -1.378132 -1.704067
H  2.26513 -2.503193 -0.377317
H  4.450718 0.648507 1.36204
H  4.871643 1.764693 0.0515
H  -2.224846 3.260154 0.359668
H  -2.423045 2.131141 1.730861
H  -1.739541 -1.062725 -1.725396
H  -2.299179 -2.253167 -0.485552
H  -4.683947 2.042247 0.883145
H  -4.17216 2.379623 -0.796006
H  3.170855 -0.827081 2.080925
H  1.603067 -0.048131 2.351979
H  1.668983 -1.75954 1.861921
H  4.416379 -2.023024 0.727023
H  4.717654 -2.433648 -0.975161
H  5.128767 -0.087067 -1.542926
H  3.419681 2.256909 -1.782571
H  3.1518 0.573175 -2.290824
H  1.766345 1.634945 -1.965845
H  -3.970302 -0.666682 -2.041278
H  6.871805 -1.177613 -0.306006
H  -6.543986 -0.044491 -0.890929
H  -6.00909 -1.734135 -0.91187
H  -6.980609 -1.160918 0.477098
