program: Gaussian 09
title: 000227098
version: EM64L-G09RevD.01
frameworkgroup: C1[X(C8H7FN2O5)]
method: RPBEPBE
basis: SDD
operation: Freq
keyword: #p
keyword: freq=noraman
keyword: PBEPBE/SDD
title: #p freq=noraman PBEPBE/SDD
converged: YES YES NO NO
title: Mulliken charges:
elementType: F O O O O O N N C C C C C C C C H H H H H H H
charge: -0.136690 -0.198009 -0.189471 -0.165124 -0.197600 -0.173965 0.010131 0.026444 0.263592 0.316283 0.278890 -0.478055 -0.437439 0.215658 -0.255082 -0.671211 0.338840 0.295225 0.227646 0.225646 0.216241 0.240995 0.247056
chargesum: 0.00000
title: Mulliken charges with hydrogens summed into heavy atoms:
elementType: F O O O O O N N C C C C C C C C
charge: -0.136690 -0.198009 -0.189471 -0.165124 -0.197600 -0.173965 0.010131 0.026444 0.263592 0.316283 0.278890 -0.139215 -0.142214 0.215658 0.198209 0.033082
polarizability: 1.99135974e+02 1.75131911e+00 1.45478219e+02 4.88490220e+00 2.76278376e+00 5.98451675e+01
1716.lowfreq: -5.1335 -4.4609 -0.0006 -0.0003 0.0005 2.4983 18.0698 38.9510 43.8125
frequency: 18.0301 38.9369 43.8118 84.8599 103.7692 109.3760 144.3719 155.5287 229.6193 233.6151 243.7200 273.7208 312.6907 314.2614 331.1215 390.7720 402.2489 454.9799 505.4983 569.3259 612.3199 627.2569 642.7544 679.1224 712.5434 713.0356 741.4147 755.0847 802.0295 820.4941 849.0623 868.5005 955.3930 1012.9353 1028.6084 1098.9780 1115.9946 1129.1528 1156.9404 1193.8423 1214.4356 1236.6729 1264.4185 1267.6945 1344.3897 1365.3741 1375.4102 1400.5145 1404.9242 1430.6875 1459.9503 1466.1124 1480.0634 1487.9982 1569.1782 1621.0604 2977.9467 3005.2210 3045.7870 3102.5855 3119.0182 3182.1125 3190.5788
redmass: 15.4897 8.7695 6.8843 7.7153 1.7809 3.9410 5.4619 12.1830 5.8729 1.2811 9.3819 5.4305 7.3019 11.5590 11.3181 7.8025 8.4839 3.4495 8.1732 7.9634 10.0876 5.8736 8.4580 6.4821 6.1282 4.0196 6.8845 12.6568 5.9338 1.2156 1.5709 4.5074 1.4204 2.4563 3.4919 8.0245 2.2713 1.4203 2.1419 11.0065 10.3337 1.3620 1.1465 5.6686 4.5123 1.7351 11.3515 5.0877 1.4346 8.7663 1.0381 1.4311 1.2854 1.5118 9.8829 7.8682 1.0553 1.0369 1.1087 1.0988 1.1020 1.0916 1.0915
irintensity: 0.1586 0.4940 0.2369 0.1053 1.1305 0.4136 9.6834 3.0956 0.1630 1.3394 3.1885 0.6723 0.1246 0.2669 1.1621 1.1507 2.4423 2.4824 1.2454 7.3111 4.6256 10.5351 36.5017 19.4334 1.4905 3.0680 0.4153 20.0113 12.1191 23.2427 18.1860 26.0140 32.9492 40.7510 162.4824 10.3092 2.2186 6.5662 68.2507 450.2958 207.1221 8.2954 0.1439 239.6122 39.2017 8.5202 94.6307 59.7044 61.1073 33.1569 14.1896 63.4020 21.2109 9.3686 116.5581 336.2145 24.5043 13.8762 20.7977 18.3927 23.2157 23.6049 0.2318
temp: 298.150 k
press: 1.00000 atm
elementType: 9 8 8 8 8 8 7 7 6 6 6 6 6 6 6 6 1 1 1 1 1 1 1
symmnumber: 1
zpe: 397685.7 jmol-1
zpe.correction: 0.151470 hartree
zpe.thermalcorrener: 0.166447 hartree
zpe.thermalcorrenthalpy: 0.167391 hartree
zpe.thermalcorrgfe: 0.106932 hartree
zpe.sumelectzpe: -893.138778 hartree
zpe.sumelectthermal: -893.123801 hartree
zpe.sumelectthermalent: -893.122857 hartree
zpe.sumelectthermalfe: -893.183316 hartree
dipole: -5.7116 -5.3049 0.1146
dipole: 7.7960
quadrupole: -104.3941 -99.6201 -89.1483
quadrupole: 16.9725 -2.1071 -0.9942
quadrupole: -6.6732 -1.8993 8.5725 16.9725 -2.1071 -0.9942
hfenergy: -893.290248 hartree
pointgroup: C01 [X(C8H7F1N2O5)]
dipole: 2.0973207 2.2147498 -0.3219693 debye
dipolederiv: -0.4147731 0.3075602 -0.024951 0.3817102 -0.7514463 0.0582088 -0.0262216 0.0600397 -0.1096543 -1.8345485 -0.7677744 0.1128145 -0.5836556 -0.4883535 0.0549361 0.089899 0.0391801 -0.2372232 -0.3742716 0.0151602 0.1315413 0.0263593 -0.7601304 0.2390209 0.1232645 0.1884224 -0.3929418 -0.6290128 0.1376784 0.2383732 0.1895883 -0.4437404 0.0231144 0.1778815 0.089995 -0.3622989 -0.6717917 -0.1696116 0.0450194 -0.2729579 -0.7066376 0.0517563 0.05654 0.0560122 -0.2297191 -0.8107076 0.1874159 0.0226222 0.2141942 -0.5049356 0.0083964 0.0181756 0.0141479 -0.208441 0.933605 -0.4517299 -0.4094261 -0.4504208 1.3745292 -0.3295704 -0.3059677 -0.3211801 0.5717555 2.0381413 0.1446453 -0.1299495 0.2023503 1.0522209 -0.074223 -0.1438234 -0.0947896 0.216 1.6771439 0.6251754 -0.0800048 0.0148207 0.3594319 -0.0109286 0.0146525 -0.1033085 0.1453317 -0.6267413 0.2032889 0.0653047 -0.1560562 -0.448943 0.0762675 0.0816762 0.0529683 -0.0299788 -0.9943072 -0.1520578 0.0669745 -0.0264226 -0.4670012 0.0536488 0.0585386 0.0669392 0.0080305 0.5490676 -0.2261744 0.0036552 -0.2789014 -0.0303418 0.004655 -0.0618734 0.0816584 -0.0422401 -0.8482708 -0.0049821 0.0188787 0.3102863 -0.0885255 -0.020176 -0.0103107 -0.013578 -0.1870905 0.9600072 -0.1469065 -0.0111855 -0.0534892 1.1098221 -0.1141681 -0.0289963 -0.1012619 0.1663127 0.8171868 0.343811 -0.0539743 0.7163886 0.6579856 -0.0503137 -0.0827194 -0.0237739 0.3768761 -0.1494897 -0.0242804 0.0104016 -0.0636098 0.0220207 0.0015958 0.017283 0.0006871 0.0385079 0.1774053 -0.0139072 -0.007033 0.0135607 0.1481598 0.0013854 0.022769 -0.0070077 0.1756669 0.0828158 -0.0402634 0.0104159 -0.039089 0.0241056 0.019218 -0.0001722 0.0178424 0.1804909 -0.0320086 0.0293535 -0.0930214 -0.102936 -0.0412701 0.055367 -0.054713 0.0805557 -0.0710985 -0.0264296 0.0474308 0.0860596 -0.0996095 -0.0682672 -0.0482473 0.0704817 -0.0860644 -0.0496062 0.0100996 -0.0789282 0.0109376 -0.1110577 -0.0881652 0.0285817 0.0129898 0.0249943 0.1206425 0.0777979 0.0166981 -0.0295493 0.081536 0.0877549 0.075305 -0.0586896 0.0703887 -0.0626555 0.0890818 0.0183983 0.0160965 0.0874111 0.0517271 -0.1038303 0.0293358 -0.0928671 -0.0166669 unknown
polarizability: 197.5548939|3.7793828|144.2701865|-13.5888863|-12.3866506|62.6342803 unknown
InChI: InChI=1S/C8H7FN2O5/c1-2-16-8-3-5(9)6(10(12)13)4-7(8)11(14)15/h3-4H,2H2,1H3
charge 0 multiplicity 1
23 atoms
F  -2.012488 2.402703 -0.265113
O  2.413953 0.475111 -0.237539
O  0.857417 -3.165104 0.734517
O  2.416246 -2.203672 -0.628593
O  -3.596259 -1.522485 0.287856
O  -4.043957 0.708582 0.11332
N  1.316643 -2.177329 0.037726
N  -3.231848 -0.28993 0.148518
C  1.051052 0.354044 -0.192786
C  0.481403 -0.952425 -0.018481
C  -1.782086 -0.027359 0.02485
C  -0.902472 -1.126011 0.106956
C  0.158666 1.455051 -0.266744
C  -1.225196 1.264092 -0.167574
C  3.021772 1.832871 -0.384997
C  4.530797 1.626445 -0.393086
H  -1.315231 -2.125779 0.268309
H  0.520366 2.477053 -0.397713
H  2.661366 2.276142 -1.333594
H  2.693985 2.461033 0.466525
H  5.037567 2.600822 -0.513661
H  4.870588 1.169426 0.550869
H  4.830016 0.96912 -1.225866
