program: Gaussian 09
title: 000227096
version: EM64L-G09RevD.01
frameworkgroup: C1[X(C8H8FNO5S)]
method: RPBEPBE
basis: SDD
operation: Freq
keyword: #p
keyword: freq=noraman
keyword: PBEPBE/SDD
title: #p freq=noraman PBEPBE/SDD
converged: YES YES NO NO
title: Mulliken charges:
elementType: S F O O O O O N C C C C C C C C H H H H H H H H
charge: 0.996170 -0.138508 -0.402576 -0.495761 -0.495721 -0.185394 -0.160995 0.025326 -0.044159 -0.318057 -0.201210 0.271578 -0.219417 -0.300501 0.242151 -0.652462 0.335717 0.299467 0.229460 0.236996 0.284313 0.220541 0.237313 0.235728
chargesum: 0.00000
title: Mulliken charges with hydrogens summed into heavy atoms:
elementType: S F O O O O O N C C C C C C C C
charge: 0.996170 -0.138508 -0.402576 -0.495761 -0.495721 -0.185394 -0.160995 0.025326 -0.044159 0.017661 0.098257 0.271578 0.247040 -0.016188 0.242151 0.041120
polarizability: 1.92646179e+02 8.56056961e-01 1.43853787e+02 3.67202072e+00 1.02652226e+01 9.64606294e+01
1716.lowfreq: -6.1826 -4.1131 -1.9595 -0.0016 -0.0010 -0.0006 14.5865 25.9647 36.0174
frequency: 14.3623 25.9485 35.9598 46.3528 51.1816 101.3425 115.1056 145.4687 192.2305 202.8736 222.0471 232.4861 252.3560 264.8563 311.4474 326.7024 369.9315 391.1351 396.7704 431.6287 472.5400 525.2904 544.4820 575.5059 614.2874 656.3293 678.8966 733.8030 756.8392 818.7527 821.5917 824.3466 840.8399 845.5075 934.2028 962.1626 975.8725 1006.9075 1061.3421 1071.0857 1098.4630 1135.6386 1139.2392 1198.2941 1210.6293 1240.5712 1246.5369 1348.9325 1365.0619 1392.0683 1394.4082 1405.5147 1456.3865 1459.5782 1477.9252 1489.5140 1588.2644 1601.1918 2992.2939 2997.5635 3059.8105 3094.0550 3114.2578 3166.1766 3168.6001 3187.4892
redmass: 5.4770 14.4215 3.9856 4.3702 2.4113 11.1042 7.0665 5.7430 9.4160 7.1200 6.5686 1.6818 3.5345 4.1659 12.0332 8.2571 10.4969 9.2441 8.1523 3.7814 12.9541 4.8369 5.7749 6.8391 8.9040 8.5668 6.8531 4.8010 8.6639 2.2774 1.7488 3.1940 1.5016 8.3410 1.4402 12.9346 1.3910 2.6638 2.0230 5.4337 2.2016 1.4011 1.3775 8.5848 3.8089 1.4049 1.1578 1.2630 5.5585 1.2153 9.0700 6.1087 1.0400 2.8841 1.0476 1.0824 8.1505 8.0221 1.0515 1.0397 1.1094 1.0978 1.1025 1.0905 1.0928 1.0970
irintensity: 2.1395 0.1475 1.3655 0.3099 0.4887 4.8599 6.3525 6.3993 0.6012 3.5059 4.4240 1.1922 3.0250 2.0970 3.9863 1.1145 1.8509 4.0323 20.4224 0.9074 116.7883 4.3556 1.0130 115.8004 9.1290 9.5890 4.1115 3.3428 13.9450 47.3927 26.4007 25.9382 50.7583 71.5199 14.0303 72.0957 1.7175 63.0606 59.7345 3.1865 58.4238 5.3379 20.8272 193.9474 61.2113 23.1963 0.3229 7.1302 29.3709 16.0618 23.3455 38.8998 14.7131 111.8391 10.9628 16.6792 27.9428 37.1545 29.2670 27.0695 10.2550 20.7245 28.5918 4.7273 19.1242 2.3909
temp: 298.150 k
press: 1.00000 atm
elementType: 16 9 8 8 8 8 8 7 6 6 6 6 6 6 6 6 1 1 1 1 1 1 1 1
symmnumber: 1
zpe: 411989.3 jmol-1
zpe.correction: 0.156918 hartree
zpe.thermalcorrener: 0.173527 hartree
zpe.thermalcorrenthalpy: 0.174471 hartree
zpe.thermalcorrgfe: 0.109061 hartree
zpe.sumelectzpe: -1236.946778 hartree
zpe.sumelectthermal: -1236.930169 hartree
zpe.sumelectthermalent: -1236.929225 hartree
zpe.sumelectthermalfe: -1236.994635 hartree
dipole: -2.5077 2.2251 3.2964
dipole: 4.7017
quadrupole: -108.7395 -100.7520 -103.7579
quadrupole: 16.6093 -8.5192 0.8241
quadrupole: -4.3231 3.6645 0.6586 16.6093 -8.5192 0.8241
hfenergy: -1237.1036963 hartree
pointgroup: C01 [X(C8H8F1N1O5S1)]
dipole: 1.0223775 1.119327 -1.059987 debye
dipolederiv: 2.0260013 -0.0904297 0.043595 -0.2346297 1.1705733 0.0571586 -0.1931571 0.1730372 1.577396 -0.8609757 0.2306269 -0.2586859 0.1922241 -0.2342121 0.0700359 -0.2949121 0.097247 -0.2037901 -1.0471857 0.1620157 0.1830423 0.2378694 -0.4716587 -0.0764847 0.2451409 -0.1034644 -0.6352095 -0.6786998 -0.0363789 -0.0667488 0.0355404 -0.6059325 -0.15114 0.0128467 -0.0647642 -0.538348 -0.6678985 0.0270892 -0.0026619 0.0354191 -0.506203 0.1527127 0.0341674 0.0137503 -0.5893857 -0.5191329 0.0063213 -0.0027416 0.0144195 -0.7595558 -0.0082401 -0.0161632 0.0171715 -0.2044953 -0.8068391 0.0032815 -0.025786 -0.143781 -0.4323648 -0.0268364 -0.0403477 -0.0275584 -0.19088 1.3289314 0.2460817 0.0066184 0.4054155 1.3900219 0.0604891 0.0537673 0.0306919 0.1832077 -0.0218704 -0.0745215 0.0318212 -0.0694186 -0.3138854 0.0027145 -0.0260676 -0.0104276 -0.2167576 0.0155119 0.1787093 0.0056848 0.1804265 -0.0561574 0.0458444 -0.049044 0.0194095 -0.0350562 -0.0677578 0.0450651 0.0152045 -0.1933224 0.1224684 -0.0704427 0.0366247 -0.0060795 -0.037737 -0.34311 -0.1995274 -0.0331399 -0.229082 -0.4102214 0.0052832 -0.0603727 0.0014817 0.0495285 0.9024927 -0.1797794 -0.3087485 -0.1729626 0.3506303 0.0743013 0.1914599 -0.0692196 0.0670844 -0.3843609 -0.0440125 -0.0536623 -0.1537178 0.0072697 -0.07124 -0.0462636 -0.0376426 -0.1255716 1.0150259 -0.3162958 0.3248885 0.0294184 0.4610045 -0.0543682 0.3207037 -0.1254297 0.263375 -0.2123569 0.1006533 0.1933361 0.0819203 0.0294498 -0.0867642 -0.0693265 -0.0052273 0.0262126 0.194776 0.0093307 -0.0120555 0.03935 0.1474437 0.0043368 0.022851 0.0154108 0.1544551 0.1341091 -0.0590342 -0.0101562 -0.0356062 0.1186178 0.0067073 -0.0003269 -0.0158547 0.1468959 -0.1160791 -0.0118213 0.0219428 -0.0856679 -0.0461375 -0.0838079 -0.0662247 -0.0529356 0.0414238 -0.0139853 0.0049564 0.073199 0.0581601 -0.035244 0.0665047 -0.0483879 0.1036995 -0.0036344 0.0577711 0.0258738 -0.0384385 0.0171295 0.0372527 0.0297229 -0.0494311 0.0335654 0.1642106 -0.1155575 0.0894733 0.0287456 0.1050834 0.0826862 -0.0270093 0.077204 -0.031671 0.0363473 0.0448065 -0.1283449 -0.075812 -0.1051559 -0.0036784 -0.048723 -0.031371 -0.0334216 0.0646807 0.1363838 0.0106673 -0.0394411 -0.009032 -0.0421675 0.1292455 -0.0033697 0.0782313 0.0060478 unknown
polarizability: 192.2129681|-1.1527822|145.9556178|7.511284|-0.4521859|94.7920094 unknown
InChI: InChI=1S/C8H8FNO5S/c1-2-15-16(13,14)6-3-4-7(9)8(5-6)10(11)12/h3-5H,2H2,1H3
charge 0 multiplicity 1
24 atoms
S  2.108875 0.322121 1.038208
F  -3.511174 1.329181 -0.889313
O  2.800419 -0.100128 -0.634511
O  2.716421 1.733142 1.550301
O  2.158757 -0.997213 1.97631
O  -2.196782 -2.599345 -0.088009
O  -4.008091 -1.216646 -0.226903
N  -2.743741 -1.431461 -0.141599
C  0.356643 0.608804 0.430179
C  -0.502736 -0.489196 0.347981
C  -0.019586 1.923466 0.103119
C  -1.829663 -0.25939 -0.07824
C  4.198451 -0.622725 -0.581311
C  -1.339686 2.141528 -0.334755
C  -2.232758 1.056169 -0.426209
C  4.51673 -1.031528 -2.021416
H  -0.187286 -1.50276 0.614757
H  0.695285 2.746056 0.201585
H  4.874965 0.175923 -0.223572
H  4.239917 -1.487189 0.107848
H  -1.69213 3.138041 -0.613838
H  5.547564 -1.428958 -2.067225
H  3.823549 -1.81508 -2.370158
H  4.445056 -0.166611 -2.701832
