program: Gaussian 09
title: 000227094
version: EM64L-G09RevD.01
frameworkgroup: C1[X(C9H12N4O)]
method: RPBEPBE
basis: SDD
operation: Freq
keyword: #p
keyword: freq=noraman
keyword: PBEPBE/SDD
title: #p freq=noraman PBEPBE/SDD
converged: NO YES NO YES
title: Mulliken charges:
elementType: O N N N N C C C C C C C C C H H H H H H H H H H H H
charge: -0.247496 -0.173863 -0.025857 -0.038678 -0.081617 -0.052355 0.143918 0.054389 -0.673990 -0.673986 -0.400292 0.176420 -0.349745 -0.505504 0.245889 0.239825 0.211852 0.226753 0.226754 0.211853 0.239820 0.278309 0.247473 0.243686 0.243685 0.232755
chargesum: 0.00000
title: Mulliken charges with hydrogens summed into heavy atoms:
elementType: O N N N N C C C C C C C C C
charge: -0.247496 -0.173863 -0.025857 -0.038678 -0.081617 0.193534 0.143918 0.054389 0.004440 0.004441 -0.121983 0.176420 -0.102271 0.214622
polarizability: 1.84561079e+02 2.48252315e+00 1.28872321e+02 -3.12282628e-03 3.31464069e-03 7.55154250e+01
1716.lowfreq: -0.0009 -0.0006 -0.0004 4.7710 6.2777 12.6287 38.2760 62.0692 115.5199
frequency: 37.7777 62.0566 115.5193 126.5772 135.1116 178.3797 205.4873 209.2660 227.5677 245.3378 273.7452 290.1190 349.8351 407.8945 417.1036 494.4356 564.8169 592.3547 614.7997 639.4972 669.5993 676.5782 702.3128 785.1952 841.1999 842.0635 881.9753 911.5431 927.3064 928.1678 945.5339 985.1013 1026.5514 1108.4428 1112.5490 1124.8279 1144.2300 1159.0370 1180.9007 1213.1443 1231.4954 1286.7582 1313.6974 1320.0060 1338.1110 1361.4899 1377.5372 1378.8750 1394.6557 1409.2833 1438.4398 1441.7360 1449.5123 1460.3067 1463.9135 1471.0436 1474.4338 1492.0727 1516.1069 1583.9834 2991.7512 2994.3539 3007.8673 3030.5324 3090.7438 3095.7235 3099.8261 3106.4577 3111.0196 3150.8256 3169.0513 3237.0386
redmass: 3.1889 3.3751 2.4251 3.4967 1.3457 3.5907 1.0531 2.9232 6.4535 1.3771 2.1728 6.6577 4.0768 2.5905 3.7469 8.5453 3.8749 3.4581 6.1808 6.5062 11.0408 5.2924 5.8626 4.1721 8.0454 1.5637 2.7231 8.1129 1.4416 1.1895 1.4482 3.6809 3.1157 2.6397 1.2548 2.1628 2.2932 1.8639 1.9253 2.1767 5.7630 5.5002 2.6633 1.3979 6.0958 1.8831 1.2127 2.1704 1.2206 1.8318 6.0655 1.5361 1.0505 1.0443 1.0515 1.0486 1.0510 1.0654 7.7396 9.8769 1.0349 1.0354 1.0291 1.0859 1.1004 1.1000 1.1013 1.1001 1.1045 1.1053 1.0924 1.0982
irintensity: 0.5711 2.3142 1.3346 4.2744 0.0006 3.4291 0.0522 2.5936 2.0209 1.6986 0.0309 2.9141 4.3464 1.3640 10.7713 0.6614 0.3947 3.9820 26.0999 0.2454 1.2863 1.0372 2.0512 20.5598 25.8685 14.0279 10.7474 2.9649 11.9419 4.6406 0.0221 47.3800 90.6039 2.4309 0.0719 24.2077 9.8839 7.8478 2.8676 4.6193 125.9407 7.4924 123.6359 1.5975 172.5326 6.2208 23.5431 58.8659 29.9466 13.2737 62.6305 8.2833 14.0098 4.4684 31.0998 1.5187 19.3448 8.9550 155.5536 221.8460 23.4710 21.4004 47.4017 0.9209 14.7016 55.7355 5.2706 32.0378 24.5501 19.9287 15.0690 0.8422
temp: 298.150 k
press: 1.00000 atm
elementType: 8 7 7 7 7 6 6 6 6 6 6 6 6 6 1 1 1 1 1 1 1 1 1 1 1 1
symmnumber: 1
zpe: 542163.1 jmol-1
zpe.correction: 0.206499 hartree
zpe.thermalcorrener: 0.219673 hartree
zpe.thermalcorrenthalpy: 0.220617 hartree
zpe.thermalcorrgfe: 0.166538 hartree
zpe.sumelectzpe: -643.330105 hartree
zpe.sumelectthermal: -643.316932 hartree
zpe.sumelectthermalent: -643.315988 hartree
zpe.sumelectthermalfe: -643.370067 hartree
dipole: 0.5851 0.0804 0.0000
dipole: 0.5906
quadrupole: -66.1046 -86.1477 -82.7786
quadrupole: -4.2782 -0.0007 -0.0001
quadrupole: 12.2390 -7.8040 -4.4350 -4.2782 -0.0007 -0.0001
hfenergy: -643.5366044 hartree
pointgroup: C01[X(C9H12N4O1)]
dipole: -0.23059 0.0285765 0.0000063 debye
dipolederiv: -1.5989596 -0.3241191 0.0000574 -0.7649299 -0.5763077 0.0000397 0.0000863 0.0000271 -0.3125729 -0.606252 0.1796376 -0.0000028 -0.2276349 -0.3435218 0.0000112 0.000047 0.000002 -0.1910743 -0.3449108 0.1567062 -0.0000053 0.4806933 0.0115961 -0.0000283 -0.0000312 -0.0000198 -0.1986854 -0.7908579 0.0712351 0.0000138 0.1295267 -0.5068138 0.0000195 0.0000138 0.0000169 -0.1812266 -0.7063529 -0.0263533 0.0000175 -0.5774123 -0.9155681 0.0000643 0.0000548 0.0000477 -0.1969507 0.8203127 0.0904289 -0.0000127 0.3092699 0.1505592 0.0000075 -0.0000426 0.0000159 0.3202912 0.8301565 -0.3247015 0.0000002 -0.1145971 0.2142074 -0.0000076 -0.0000199 0.0000021 0.0703435 -0.8450966 -0.0876745 0.0000325 -0.2282233 -0.1859156 0.0000184 0.0000432 0.0000178 0.0221229 -0.0925317 0.0114917 0.028636 -0.0289668 0.0542763 -0.0357203 0.0242536 -0.03122 -0.0786538 -0.0925344 0.0114854 -0.0286305 -0.0289807 0.0542995 0.0356936 -0.0242476 0.031188 -0.0786775 -0.0582024 -0.1123088 0.0000029 -0.1273429 0.2450385 -0.0000208 0.0000054 -0.0000223 -0.0971766 1.5904603 0.3058993 -0.0000608 0.9812899 0.9496538 -0.0000757 -0.0001064 -0.0000562 0.2243874 0.8560517 0.0836533 -0.0000355 0.2172069 0.6167738 -0.00005 -0.0000456 -0.0000467 -0.0608067 0.8968355 0.0835998 -0.000023 -0.0732005 0.2306118 0.0000051 -0.0000094 0.0000008 0.2636217 0.0385837 0.0577074 -0.0000082 -0.0051759 -0.0414234 0.0000116 -0.0000035 0.0000091 0.0465075 0.1271602 0.0047274 0.0102169 0.0540592 -0.0949965 -0.0272775 -0.0047407 0.0310617 0.0815391 -0.1690392 -0.095165 0.0237307 -0.1112832 0.0514445 -0.003464 0.0207871 -0.0201631 0.0877627 0.0543485 0.0468026 -0.1108441 0.0435999 0.0703423 0.0508275 -0.0806271 0.0367459 -0.1002658 0.0543429 0.0468198 0.1108371 0.0436147 0.07033 -0.050853 0.0806273 -0.0367724 -0.1002428 -0.1690301 -0.0951779 -0.0237116 -0.1112963 0.0514361 0.00347 -0.0207734 0.0201706 0.0877583 0.127146 0.0047364 -0.0102255 0.0540726 -0.095002 0.0273097 0.004727 -0.0310301 0.0815387 0.0759874 -0.0234562 0.000005 -0.0136976 0.0070132 0.0000124 0.0000055 0.0000136 0.1710042 0.0662174 0.0406902 -0.0000009 0.0257915 -0.0768405 0.0000123 -0.0000005 0.000013 0.1245218 -0.0180551 -0.0162671 0.0027832 0.1138723 0.0556194 0.0967829 -0.0481113 0.0790445 -0.0539507 -0.0180545 -0.0162705 -0.0027806 0.1138745 0.0555959 -0.0968034 0.0480948 -0.079059 -0.0539296 -0.0277255 -0.0741275 0.0000084 -0.1541301 -0.0524084 0.0000149 0.0000136 0.0000129 0.1228144 unknown
polarizability: 184.617196|-1.7420421|128.8162041|-0.0030785|-0.0033558|75.515425 unknown
InChI: InChI=1S/C9H12N4O/c1-6(2)13-8-7(4-12-13)9(14-3)11-5-10-8/h4-6H,1-3H3
charge 0 multiplicity 1
26 atoms
O  -3.032836 -1.050317 0.000087
N  1.55059 -0.188406 -0.000121
N  1.403546 -1.582256 -0.000011
N  0.080401 1.795203 -0.000209
N  -2.298966 1.202454 -0.000088
C  2.897567 0.432827 -0.000197
C  0.324258 0.446556 -0.000125
C  -0.672023 -0.589144 -0.000011
C  3.662957 0.042393 -1.282682
C  3.662969 0.042681 1.282372
C  0.062776 -1.817358 0.000046
C  -2.017721 -0.124066 -0.000004
C  -1.243389 2.089919 -0.000181
C  -4.420225 -0.527331 0.000081
H  2.695153 1.519877 -0.000317
H  3.809687 -1.050554 -1.320749
H  4.65217 0.533265 -1.292419
H  3.110293 0.354599 -2.185963
H  3.110275 0.355021 2.185586
H  4.652152 0.533617 1.292027
H  3.809771 -1.05025 1.320642
H  -0.306185 -2.840218 0.000133
H  -1.511988 3.150219 -0.000241
H  -4.598113 0.088011 -0.897242
H  -4.598078 0.08813 0.897331
H  -5.048144 -1.429173 0.000154
