program: Gaussian 09
title: 000227091
version: EM64L-G09RevD.01
frameworkgroup: C1[X(C18H24N4O4)]
method: RPBEPBE
basis: SDD
operation: Freq
keyword: #p
keyword: freq=noraman
keyword: PBEPBE/SDD
title: #p freq=noraman PBEPBE/SDD
converged: YES YES NO NO
title: Mulliken charges:
elementType: O O O O N N N N C C C C C C C C C C C C C C C C C C H H H H H H H H H H H H H H H H H H H H H H H H
charge: -0.248691 -0.248762 -0.276357 -0.276402 -0.113565 -0.113573 -0.458224 -0.458167 -0.398991 -0.372170 -0.399124 -0.372229 0.241072 0.241129 0.241813 0.242050 -0.191609 -0.191551 0.213915 0.213462 -0.504058 -0.503435 -0.348346 -0.348567 -0.684083 -0.683943 0.304329 0.237015 0.247174 0.264787 0.237015 0.304384 0.264809 0.247159 0.326349 0.326296 0.212644 0.229608 0.229355 0.212465 0.197364 0.238956 0.197384 0.238859 0.211213 0.221179 0.208771 0.208836 0.221182 0.211273
chargesum: 0.00000
title: Mulliken charges with hydrogens summed into heavy atoms:
elementType: O O O O N N N N C C C C C C C C C C C C C C C C C C
charge: -0.248691 -0.248762 -0.276357 -0.276402 -0.113565 -0.113573 -0.131875 -0.131871 0.142352 0.139792 0.142276 0.139738 0.241072 0.241129 0.241813 0.242050 -0.191609 -0.191551 0.213915 0.213462 -0.061806 -0.061616 0.087975 0.087676 -0.042920 -0.042652
polarizability: 3.35366781e+02 1.87057850e+01 3.09721685e+02 4.37038793e+00 -1.68869492e+00 1.50636638e+02
1716.lowfreq: -9.7694 -3.5831 -0.0013 -0.0004 0.0006 1.9863 13.5259 23.0614 26.8489
frequency: 13.5244 23.0589 26.7467 32.8968 40.6125 49.6036 51.7266 65.5132 70.4851 78.3838 79.5007 110.1623 111.8078 112.5993 126.9491 140.2233 146.0227 172.9802 174.5607 181.3441 203.6528 217.2625 226.9301 230.3363 269.8390 273.1779 280.7919 294.6183 319.7315 346.1257 351.5029 384.6069 386.5838 408.5707 432.2738 457.5691 479.0661 523.3145 526.6239 570.3706 605.8466 608.7102 640.7847 649.6568 713.0659 717.8856 739.7746 746.2232 747.5042 776.0558 779.9247 780.2173 785.6311 786.7418 823.6278 868.8026 869.0797 888.0355 896.7225 922.3056 929.8132 940.7022 970.3855 987.4670 1000.3660 1003.4464 1046.5912 1056.6285 1058.2530 1058.5195 1079.8006 1093.4168 1098.5435 1104.9023 1110.8002 1115.8500 1116.9246 1121.9224 1124.4677 1125.0440 1127.1473 1132.1218 1138.9924 1182.2788 1208.0122 1213.3905 1232.8617 1235.4325 1276.0618 1276.2997 1308.6764 1309.9501 1323.0481 1344.6746 1351.3440 1357.8864 1390.8571 1390.9019 1442.1718 1443.9344 1445.2749 1448.3880 1457.8430 1457.9548 1467.3926 1468.3726 1474.9709 1475.0561 1476.9967 1477.0553 1483.5706 1485.3140 1485.3509 1490.5242 1518.8003 1522.0445 1613.8243 1615.8899 1654.3773 1654.6623 2972.9647 2973.0660 2975.8197 2976.3601 2987.4374 2987.4573 3028.5567 3029.0427 3049.3110 3049.4982 3075.2148 3075.2394 3075.7524 3075.8425 3078.2792 3078.3298 3090.1947 3090.4590 3190.1051 3190.1525 3204.7093 3204.7322 3472.2002 3472.2560
redmass: 4.0974 3.6734 3.6269 4.0140 3.4694 2.1661 2.1413 3.0864 3.5564 4.0356 4.1980 3.4273 3.1710 3.8986 5.5974 4.3227 4.7771 3.8988 3.6011 4.2176 3.9200 2.4224 1.1236 1.3440 5.1885 5.0504 5.8796 4.9775 6.3221 3.3116 3.3362 4.9013 7.3229 7.2360 4.9636 10.6159 11.1254 4.1140 4.6157 5.2201 3.6818 3.7716 1.5232 1.7017 4.0859 7.4439 2.2959 1.7681 1.2413 3.2712 4.3295 8.3436 1.0448 1.2495 4.7750 1.3652 1.3344 2.1895 2.0092 5.6886 4.5992 6.0096 3.0283 1.1441 1.3165 3.6947 3.2668 2.6054 2.5666 2.2739 1.8321 1.6384 1.9708 1.7296 1.7210 1.3484 1.3415 1.8962 1.3301 1.4640 1.5553 1.5167 2.3859 4.5479 1.8935 1.6919 1.4281 1.4859 1.2090 1.2071 1.3820 1.3831 5.6652 2.2590 1.6575 3.1385 1.2146 1.2149 1.8345 1.1385 1.4048 2.3513 1.1457 1.1782 1.3685 1.3667 1.0524 1.0515 1.0451 1.0450 3.2589 1.0821 1.0819 2.5773 6.2314 4.5387 6.0060 6.1562 8.6279 8.3757 1.0381 1.0375 1.0574 1.0581 1.0634 1.0634 1.0974 1.0975 1.1006 1.1007 1.0992 1.0993 1.1004 1.1003 1.0525 1.0523 1.0581 1.0581 1.1177 1.1177 1.1160 1.1160 1.0750 1.0750
irintensity: 0.3882 1.3268 0.1583 2.1296 0.0126 1.2602 0.7403 1.9945 0.0231 0.0035 7.0065 12.1514 0.0069 1.4391 0.0007 0.0235 20.1759 0.0781 12.4539 19.5894 0.0005 0.0004 0.1419 0.0002 10.6775 22.3253 0.0038 8.4027 0.0005 0.0001 0.2847 0.0030 32.3387 0.0001 20.2717 0.0001 0.0000 0.0265 23.6081 42.9846 0.0102 0.7139 0.1025 115.7197 0.0181 10.9149 36.5684 2.9708 0.0715 0.0025 7.6681 0.0267 25.6517 0.0020 0.0001 0.0992 0.0137 20.1190 0.0029 49.1091 9.0181 0.0006 0.0000 4.6492 0.0032 60.9459 9.5836 0.0013 4.9679 0.0317 0.0004 27.3357 0.0326 17.3513 2.1999 0.0110 38.3214 0.0024 10.5013 0.0006 0.0018 3.3609 0.0016 9.0544 174.2931 0.0026 50.5961 0.5907 8.6596 25.4395 0.1699 16.3617 202.4038 0.0005 47.7819 0.0009 12.3982 4.9028 215.6588 7.3551 222.8251 0.0278 1.5843 0.4128 0.1182 217.0734 4.5690 2.2468 12.9785 13.2189 0.0064 11.1939 5.4991 707.8488 320.5475 0.0162 153.1306 0.9278 690.4359 38.5767 50.0180 25.1700 11.9882 9.8870 1.2406 61.2328 7.9945 7.9950 0.6343 0.7367 40.0287 45.3037 60.2141 80.5739 45.5407 3.6149 0.9711 61.6360 4.9664 4.9768 17.1263 2.1535 54.1493 10.0418
temp: 298.150 k
press: 1.00000 atm
elementType: 8 8 8 8 7 7 7 7 6 6 6 6 6 6 6 6 6 6 6 6 6 6 6 6 6 6 1 1 1 1 1 1 1 1 1 1 1 1 1 1 1 1 1 1 1 1 1 1 1 1
symmnumber: 1
zpe: 1051187.2 jmol-1
zpe.correction: 0.400376 hartree
zpe.thermalcorrener: 0.428537 hartree
zpe.thermalcorrenthalpy: 0.429481 hartree
zpe.thermalcorrgfe: 0.337582 hartree
zpe.sumelectzpe: -1218.183646 hartree
zpe.sumelectthermal: -1218.155485 hartree
zpe.sumelectthermalent: -1218.154541 hartree
zpe.sumelectthermalfe: -1218.246440 hartree
dipole: -0.0035 -0.0030 -0.0044
dipole: 0.0064
quadrupole: -132.6819 -141.8728 -157.3985
quadrupole: 4.4927 17.8478 5.3334
quadrupole: 11.3025 2.1116 -13.4141 4.4927 17.8478 5.3334
hfenergy: -1218.5840219 hartree
pointgroup: C01 [X(C18H24N4O4)]
dipole: 0.0012485 0.0018992 -0.0010672 debye
polarizability: 332.2366015|21.3620162|284.3673745|2.4092771|61.5584729|179.1211285 unknown
InChI: InChI=1S/C18H24N4O4/c1-3-5-11(23)19-13-15(21-7-8-21)18(26)14(20-12(24)6-4-2)16(17(13)25)22-9-10-22/h19-20H,3-10H2,1-2H3
charge 0 multiplicity 1
50 atoms
O  -1.123561 2.065424 1.393482
O  1.123794 -2.074896 -1.393165
O  -3.76895 -0.288809 -1.463804
O  3.768141 0.280598 1.465545
N  1.455541 2.321716 0.543701
N  -1.45525 -2.331429 -0.543288
N  -2.816307 0.09527 0.642103
N  2.816751 -0.105502 -0.640607
C  2.710992 3.009112 0.871453
C  1.351659 3.460375 1.450255
C  -2.710931 -3.017616 -0.873012
C  -1.351508 -3.469005 -1.451363
C  0.859312 1.127542 0.338211
C  -0.859012 -1.137204 -0.337635
C  -1.435472 -0.018299 0.277703
C  1.435788 0.008482 -0.276859
C  -0.620898 1.102115 0.703878
C  0.621185 -1.111805 -0.703204
C  -3.883897 0.0863 -0.256537
C  3.883889 -0.095197 0.25849
C  -5.217457 0.562036 0.328539
C  5.218465 -0.569506 -0.325005
C  -6.402017 -0.336821 -0.099642
C  6.398421 0.341992 0.0899
C  -7.761193 0.230974 0.358096
C  7.759975 -0.221909 -0.365631
H  3.405427 2.466292 1.518157
H  3.157484 3.593529 0.058163
H  0.861928 4.356223 1.053714
H  1.131064 3.240345 2.499313
H  -3.158447 -3.602833 -0.060872
H  -3.404528 -2.473504 -1.519544
H  -1.129966 -3.247765 -2.49996
H  -0.862709 -4.3657 -1.055599
H  -2.958376 0.629906 1.507555
H  2.959028 -0.64122 -1.505362
H  -5.165964 0.630107 1.43256
H  -5.394885 1.589044 -0.050642
H  5.403678 -1.590507 0.06623
H  5.16502 -0.650794 -1.428003
H  -6.259734 -1.353648 0.317757
H  -6.376736 -0.439692 -1.199824
H  6.248236 1.353266 -0.338103
H  6.375705 0.456208 1.189044
H  -7.939699 1.231907 -0.078432
H  -8.592752 -0.426126 0.044854
H  -7.807458 0.331438 1.459073
H  7.803813 -0.333811 -1.465594
H  8.588164 0.443777 -0.061738
H  7.94595 -1.216982 0.081049
