program: Gaussian 09
title: 000227090
version: EM64L-G09RevD.01
frameworkgroup: C1[X(C16H20N4O4)]
method: RPBEPBE
basis: SDD
operation: Freq
keyword: #p
keyword: freq=noraman
keyword: PBEPBE/SDD
title: #p freq=noraman PBEPBE/SDD
converged: YES YES NO NO
title: Mulliken charges:
elementType: O O O O N N N N C C C C C C C C C C C C C C C C H H H H H H H H H H H H H H H H H H H H
charge: -0.245977 -0.245974 -0.240958 -0.240953 -0.098946 -0.098940 -0.451083 -0.451053 -0.065320 -0.065318 -0.425469 -0.425465 0.262591 0.262580 -0.693087 -0.693078 0.209583 0.209621 -0.162316 -0.162345 0.205892 0.205873 -0.779527 -0.779541 0.250977 0.250976 0.242064 0.253551 0.242063 0.253553 0.207554 0.243487 0.234423 0.207554 0.243477 0.234427 0.329207 0.329197 0.241478 0.223020 0.258849 0.241463 0.223029 0.258858
chargesum: 0.00000
title: Mulliken charges with hydrogens summed into heavy atoms:
elementType: O O O O N N N N C C C C C C C C C C C C C C C C
charge: -0.245977 -0.245974 -0.240958 -0.240953 -0.098946 -0.098940 -0.121875 -0.121856 0.185657 0.185657 0.070146 0.070152 0.262591 0.262580 -0.007622 -0.007620 0.209583 0.209621 -0.162316 -0.162345 0.205892 0.205873 -0.056180 -0.056191
polarizability: 3.28899222e+02 2.55603559e+01 2.74073766e+02 -1.18181418e-02 -4.90545297e-03 1.41284494e+02
1716.lowfreq: -7.3212 -5.7127 -3.4953 -0.0007 -0.0006 0.0005 27.5759 34.3401 44.5332
frequency: 27.5741 34.3400 44.4899 51.4351 53.1368 56.9969 67.3069 74.3982 81.8225 87.3757 96.0848 101.9479 109.7087 132.5444 153.0732 156.4353 162.7948 185.9050 193.2282 219.6275 246.7243 250.2977 278.3946 297.1274 301.7794 333.5126 367.3479 368.8775 388.7926 403.3073 430.0249 435.6368 445.4997 465.9138 486.2398 505.8903 530.8805 558.0499 585.1064 604.5660 646.3380 666.1883 690.1027 696.0559 721.2397 741.6888 756.1516 772.6583 779.8984 793.3614 834.6312 882.5360 890.4638 895.9975 944.5129 965.8055 969.1278 974.3314 986.5539 1004.7248 1019.3311 1035.4615 1036.5027 1056.1178 1076.8322 1076.9626 1084.3341 1097.1702 1112.3183 1123.2580 1136.7861 1137.8633 1148.9174 1152.8187 1183.0239 1205.5038 1244.9288 1246.9082 1313.8435 1317.8817 1354.3133 1364.4308 1384.9251 1385.0246 1398.2505 1398.4855 1424.8568 1425.0937 1447.2896 1447.3829 1454.8606 1454.9537 1462.3905 1463.0021 1466.2872 1466.3543 1470.9969 1471.6962 1488.5157 1493.8098 1504.2000 1508.3350 1604.7924 1618.1926 1629.1576 1644.3517 2990.3337 2990.3873 2997.1726 2997.2574 3072.0776 3072.1490 3079.9184 3079.9686 3082.7317 3082.9409 3092.8589 3092.8856 3113.1411 3113.2167 3116.3944 3116.4161 3187.4967 3187.5088 3444.2846 3444.3367
redmass: 4.0145 5.2417 3.1543 1.8862 1.1274 1.2844 3.1348 2.6131 2.9602 5.3622 4.3807 7.1445 5.7507 4.2460 2.9214 4.9546 2.5332 1.5421 1.6849 4.1435 4.3042 4.5440 6.0490 4.3548 4.3554 6.1086 3.9169 4.2581 2.9285 2.9189 4.8957 3.6327 4.0974 6.9105 7.7674 4.4574 4.8058 4.5815 3.3267 4.4842 3.8959 6.0281 1.4579 1.4679 5.8476 6.2172 4.3267 5.4481 2.7542 3.2842 3.3519 1.6780 1.3141 2.3456 3.3456 2.7683 2.4187 2.4068 2.0045 1.2848 1.4661 1.6388 1.6569 2.1076 1.7078 1.4444 3.0676 1.4443 1.4938 1.5051 3.7142 1.6444 2.2032 2.0372 2.3109 2.3670 2.1827 2.5725 5.8110 2.8625 1.6015 2.2313 1.2287 1.2316 1.2811 1.2984 4.0100 4.2224 1.0723 1.0721 1.0493 1.0500 1.1643 1.1435 1.1187 1.1183 1.1273 1.1123 2.5345 2.0586 4.0650 9.3732 10.2833 7.4004 5.5525 7.2962 1.0372 1.0372 1.0375 1.0375 1.0865 1.0865 1.0978 1.0978 1.0566 1.0566 1.0974 1.0974 1.0996 1.0995 1.0997 1.0997 1.1173 1.1173 1.0749 1.0751
irintensity: 0.6014 0.3970 2.2745 1.1490 0.2084 0.0095 8.9211 3.6347 4.8846 0.9010 5.6754 0.9683 11.0078 1.7789 1.7290 1.5366 4.3126 0.4550 5.3235 4.8499 8.5818 0.0204 0.0117 2.7609 1.2495 18.1679 10.1799 0.0002 5.9290 0.0018 18.7571 0.6840 42.8934 2.0368 27.4662 0.0047 12.5948 4.1186 2.4965 2.2832 5.0323 2.3194 114.0913 6.9545 39.7013 7.9176 0.1614 2.5139 11.7967 1.6595 0.6136 12.1080 0.3335 56.6442 15.0098 5.7182 18.3423 5.2852 1.2271 0.7066 5.3558 9.7901 9.8206 22.6723 0.3396 4.1244 2.3670 2.5417 31.1691 3.2828 1.3203 89.2595 0.0000 9.4495 4.0948 43.2976 11.2508 184.9261 479.4247 8.9253 20.6991 0.0142 120.5332 1.9148 58.2827 28.7250 117.3177 506.2636 36.8135 5.3559 43.6156 0.6625 0.3336 30.8162 102.0918 1.8552 12.4365 32.8938 73.3301 491.4722 3.9821 318.2195 170.5762 146.7075 446.6138 1.3962 29.8005 2.3932 63.8026 1.4584 1.4775 16.4503 10.5463 17.5900 15.8182 35.0353 32.4760 24.4900 9.3821 11.6606 21.2296 14.9377 12.9424 10.2626 15.3762 61.1602
temp: 298.150 k
press: 1.00000 atm
elementType: 8 8 8 8 7 7 7 7 6 6 6 6 6 6 6 6 6 6 6 6 6 6 6 6 1 1 1 1 1 1 1 1 1 1 1 1 1 1 1 1 1 1 1 1
symmnumber: 1
zpe: 899464.7 jmol-1
zpe.correction: 0.342588 hartree
zpe.thermalcorrener: 0.368371 hartree
zpe.thermalcorrenthalpy: 0.369315 hartree
zpe.thermalcorrgfe: 0.284998 hartree
zpe.sumelectzpe: -1139.748840 hartree
zpe.sumelectthermal: -1139.723057 hartree
zpe.sumelectthermalent: -1139.722112 hartree
zpe.sumelectthermalfe: -1139.806430 hartree
dipole: 0.0001 -0.0005 -6.6851
dipole: 6.6851
quadrupole: -116.5104 -132.9541 -145.7182
quadrupole: -5.6429 -0.0020 0.0008
quadrupole: 15.2172 -1.2265 -13.9906 -5.6429 -0.0020 0.0008
hfenergy: -1140.0914278 hartree
pointgroup: C01 [X(C16H20N4O4)]
dipole: 0.0000362 0.0001982 2.6301364 debye
polarizability: 326.1252927|-28.2439207|276.8476953|0.0115499|-0.0055074|141.2844941 unknown
InChI: InChI=1S/C16H20N4O4/c1-7-5-19(7)13-11(17-9(3)21)16(24)14(20-6-8(20)2)12(15(13)23)18-10(4)22/h7-8,17-18H,5-6H2,1-4H3
charge 0 multiplicity 1
44 atoms
O  -0.131787 -2.722758 0.373292
O  0.131589 2.722669 0.372965
O  -3.651782 -0.231661 -1.526379
O  3.651727 0.231389 -1.526197
N  2.359121 -1.549639 0.41144
N  -2.359249 1.549603 0.411087
N  -2.470232 -1.458213 0.086204
N  2.470096 1.458078 0.086234
C  3.588377 -1.578874 1.24614
C  -3.588553 1.579052 1.245713
C  2.5984 -2.762314 1.207916
C  -2.598479 2.762404 1.207384
C  1.268316 -0.735408 0.30762
C  -1.268474 0.735313 0.307438
C  4.946438 -1.682942 0.578421
C  -4.946578 1.68319 0.57793
C  -1.299677 -0.657314 0.176326
C  1.299527 0.657202 0.176339
C  -0.070658 -1.44154 0.274756
C  0.070497 1.441437 0.274586
C  -3.546258 -1.251565 -0.786142
C  3.546214 1.251309 -0.785985
C  -4.608761 -2.348641 -0.741731
C  4.608753 2.348343 -0.741459
H  3.543927 -0.949394 2.147571
H  -3.54421 0.949688 2.147231
H  2.874567 -3.655768 0.637815
H  1.940373 -2.9471 2.064192
H  -2.874552 3.655806 0.637155
H  -1.940473 2.947249 2.063664
H  5.655268 -2.187065 1.261647
H  4.873652 -2.258676 -0.358614
H  5.348825 -0.690112 0.319267
H  -5.655399 2.187404 1.261099
H  -4.873707 2.258865 -0.359134
H  -5.349025 0.690378 0.318811
H  -2.308287 -2.418781 0.417715
H  2.308134 2.418683 0.417632
H  -5.488077 -1.989402 -0.175037
H  -4.25588 -3.28368 -0.273103
H  -4.94326 -2.560593 -1.770041
H  5.48724 1.9898 -0.17303
H  4.255232 3.283975 -0.274485
H  4.944682 2.558998 -1.769558
