program: Gaussian 09
title: 000227089
version: EM64L-G09RevD.01
frameworkgroup: C1[X(C18H24N4O4)]
method: RPBEPBE
basis: SDD
operation: Freq
keyword: #p
keyword: freq=noraman
keyword: PBEPBE/SDD
title: #p freq=noraman PBEPBE/SDD
converged: YES YES NO NO
title: Mulliken charges:
elementType: O O O O N N N N C C C C C C C C C C C C C C C C C C H H H H H H H H H H H H H H H H H H H H H H H H
charge: -0.246116 -0.246105 -0.242662 -0.242654 -0.097360 -0.097322 -0.460407 -0.460399 -0.062594 -0.062583 -0.428454 -0.428484 0.254246 0.254205 -0.699705 -0.699836 0.195600 0.195381 -0.162609 -0.162476 0.217962 0.218157 -0.503547 -0.503937 -0.675603 -0.675519 0.252038 0.252016 0.241917 0.252360 0.241915 0.252368 0.236287 0.252027 0.205518 0.236222 0.252283 0.205501 0.332952 0.332994 0.217421 0.240868 0.217568 0.240979 0.206947 0.218643 0.254219 0.206937 0.218533 0.254307
chargesum: 0.00000
title: Mulliken charges with hydrogens summed into heavy atoms:
elementType: O O O O N N N N C C C C C C C C C C C C C C C C C C
charge: -0.246116 -0.246105 -0.242662 -0.242654 -0.097360 -0.097322 -0.127455 -0.127405 0.189444 0.189433 0.065822 0.065799 0.254246 0.254205 -0.005872 -0.005829 0.195600 0.195381 -0.162609 -0.162476 0.217962 0.218157 -0.045258 -0.045390 0.004205 0.004258
polarizability: 3.53427489e+02 -2.69791879e+01 3.01532889e+02 1.97308781e-02 2.55733865e-02 1.58636944e+02
1716.lowfreq: -3.6264 -0.0008 -0.0005 0.0000 2.5490 4.9293 22.3872 28.8688 32.7747
frequency: 22.3842 28.8594 32.6628 46.9634 50.7789 58.0805 61.4723 72.5687 83.8830 87.2763 96.9799 99.1625 107.9850 131.1768 148.3047 151.4544 158.7477 178.9276 187.1792 199.6269 213.0675 221.0435 227.2110 240.5684 252.7105 256.6627 280.8618 309.9154 310.9927 328.1744 367.1533 372.1349 391.2543 405.9455 430.3975 436.7190 452.9624 471.9413 495.2828 518.1176 530.5825 585.0878 607.2537 609.2299 669.1200 674.3240 699.2783 713.5836 723.2708 744.3289 756.4659 768.6450 779.4929 787.4892 797.5492 801.9952 828.5998 874.3907 891.7639 892.1095 933.0102 949.7986 978.6543 987.4932 1007.6290 1015.3067 1023.9365 1036.0481 1054.0419 1073.5233 1076.9861 1077.5769 1078.0866 1078.3703 1089.1900 1097.7939 1114.7068 1121.2403 1126.9187 1137.9264 1148.1535 1152.6594 1181.1374 1195.8223 1209.4587 1215.8176 1260.5975 1260.9285 1307.3240 1309.2387 1336.7877 1339.1968 1353.5893 1363.5084 1386.6567 1386.8359 1399.7988 1399.9384 1421.4928 1421.8068 1447.6420 1447.7041 1454.8600 1454.9953 1464.5681 1465.0705 1470.1283 1470.3675 1475.8641 1476.4198 1487.0375 1487.1819 1489.4875 1494.4592 1503.6027 1507.5398 1607.3488 1622.0780 1632.2519 1645.8832 2981.5685 2981.8439 2989.3349 2989.4564 2996.3567 2996.4466 3037.3549 3037.5948 3074.9093 3074.9726 3082.9473 3083.1691 3083.2146 3083.2911 3095.0639 3095.1244 3101.6809 3101.7534 3116.0928 3116.1067 3187.6086 3187.6270 3431.7778 3431.8123
redmass: 3.6138 4.2073 2.6142 3.2568 3.9187 3.0458 2.8796 2.2928 5.2277 2.8339 3.8134 6.2809 6.2601 4.5799 4.6233 2.4778 1.9281 1.4743 1.7511 1.6970 1.2615 2.7850 3.6256 2.7161 3.8155 3.2873 5.3099 4.9342 4.6330 6.0205 3.9904 4.3578 2.8570 2.9065 4.8811 3.7082 4.9909 8.5963 7.8925 3.4789 3.5591 6.9271 4.6574 5.3271 2.8429 4.2391 1.6924 1.5060 3.9736 4.7351 4.2050 7.8265 2.8352 2.0176 1.3571 1.6707 3.0571 2.9457 1.3058 1.4021 3.3154 3.4492 3.3585 2.3660 1.8517 1.6176 1.6386 1.6543 2.0153 2.8185 1.7710 1.6263 1.6758 1.4575 2.4495 1.4592 1.4924 2.1936 1.9191 1.6540 1.9810 2.0213 2.2625 2.4171 2.1644 2.0715 1.2210 1.2313 2.4386 4.5393 1.8109 1.7717 1.6262 2.3709 1.2010 1.2032 1.2840 1.2959 3.7910 4.1221 1.0889 1.0888 1.0575 1.0597 1.1978 1.1714 1.0847 1.0857 1.1233 1.0916 1.0583 1.0600 2.5229 1.9804 3.5796 9.3253 10.6069 7.4467 5.2624 6.9819 1.0591 1.0590 1.0370 1.0369 1.0378 1.0378 1.1001 1.1001 1.0856 1.0855 1.0589 1.0586 1.0999 1.0998 1.0969 1.0969 1.1003 1.1003 1.0993 1.0993 1.1173 1.1173 1.0747 1.0749
irintensity: 0.0603 0.5553 0.0726 0.1478 3.4850 2.3491 2.4513 0.9919 0.8754 8.2606 3.6157 0.0023 12.4507 2.5077 0.0208 2.2670 2.7348 0.0092 3.5668 0.0162 3.2618 5.7378 5.3741 0.2954 0.0375 13.4122 0.2662 20.9096 1.3991 23.9287 10.5511 0.0054 2.6185 0.0091 8.6939 0.6883 39.3889 1.4142 19.6606 0.4671 8.5783 5.8602 1.2080 2.5192 5.7298 7.9595 75.4014 6.8740 43.3557 9.4437 0.8945 4.6780 9.2346 1.9577 32.8300 1.3296 3.6366 29.2357 0.2199 57.0373 27.5923 22.8416 0.2417 2.6681 4.0151 2.5852 0.0004 5.0994 11.2679 5.2352 0.1171 8.1916 0.8228 3.6063 1.4682 3.9528 24.2974 4.7685 0.0237 82.6739 0.0009 7.0611 4.1870 96.6552 199.3444 13.9433 6.3606 1.2442 5.9688 383.4189 66.0322 1.8968 32.2798 0.4685 32.9989 9.5111 55.5238 33.6095 102.5917 544.5722 10.8996 13.6162 53.8258 2.9569 2.1140 43.7390 48.2898 18.3117 6.6993 57.1192 51.5644 10.6784 70.3915 509.6275 8.0865 344.0975 220.6567 117.9159 388.4352 2.3063 17.2250 18.9978 52.5631 17.1504 64.7026 2.1261 13.0234 14.0004 3.3523 6.3451 22.5949 29.8309 50.0083 47.9026 21.1794 39.1303 20.9869 21.3343 16.6014 11.7743 12.2892 11.4743 17.8895 63.8851
temp: 298.150 k
press: 1.00000 atm
elementType: 8 8 8 8 7 7 7 7 6 6 6 6 6 6 6 6 6 6 6 6 6 6 6 6 6 6 1 1 1 1 1 1 1 1 1 1 1 1 1 1 1 1 1 1 1 1 1 1 1 1
symmnumber: 1
zpe: 1048483.4 jmol-1
zpe.correction: 0.399346 hartree
zpe.thermalcorrener: 0.427510 hartree
zpe.thermalcorrenthalpy: 0.428455 hartree
zpe.thermalcorrgfe: 0.338861 hartree
zpe.sumelectzpe: -1218.194237 hartree
zpe.sumelectthermal: -1218.166073 hartree
zpe.sumelectthermalent: -1218.165129 hartree
zpe.sumelectthermalfe: -1218.254722 hartree
dipole: 0.0003 0.0014 -6.0870
dipole: 6.0870
quadrupole: -129.4736 -146.4628 -155.9440
quadrupole: 3.8157 0.0098 0.0061
quadrupole: 14.4865 -2.5027 -11.9838 3.8157 0.0098 0.0061
hfenergy: -1218.5935831 hartree
pointgroup: C01 [X(C18H24N4O4)]
dipole: -0.0009559 0.0039782 2.3947928 debye
polarizability: 350.214313|29.7372292|304.7456909|0.0433582|-0.2227553|158.6373184 unknown
InChI: InChI=1S/C18H24N4O4/c1-5-11(23)19-13-15(21-7-9(21)3)18(26)14(20-12(24)6-2)16(17(13)25)22-8-10(22)4/h9-10,19-20H,5-8H2,1-4H3
charge 0 multiplicity 1
50 atoms
O  -0.515184 2.673946 0.432479
O  0.514903 -2.672783 0.44159
O  -3.66572 -0.249433 -1.493805
O  3.667232 0.244286 -1.490337
N  2.110879 1.878908 0.438272
N  -2.111152 -1.877741 0.4418
N  -2.651153 1.10379 0.130183
N  2.651342 -1.103383 0.137396
C  3.345274 2.087687 1.238526
C  -3.346271 -2.084075 1.241567
C  2.175866 3.094229 1.266094
C  -2.176789 -3.090379 1.27352
C  1.154395 0.907851 0.349425
C  -1.154586 -0.906953 0.35085
C  4.6404 2.437361 0.53063
C  -4.640724 -2.436107 0.533623
C  -1.381439 0.467087 0.221377
C  1.381418 -0.466591 0.224802
C  -0.273634 1.414954 0.325675
C  0.273492 -1.414136 0.330528
C  -3.67597 0.787261 -0.769788
C  3.677122 -0.78971 -0.762524
C  -4.805701 1.828052 -0.821836
C  4.807015 -1.830703 -0.809306
C  -6.19081 1.174503 -1.010899
C  6.191143 -1.178833 -1.01012
H  3.438644 1.43482 2.118997
H  -3.440529 -1.42835 2.119821
H  2.285107 4.036344 0.718788
H  1.523749 3.14455 2.145271
H  -2.285438 -4.03428 0.729188
H  -1.525488 -3.137782 2.153464
H  4.440313 3.067856 -0.351669
H  5.162455 1.53576 0.173616
H  5.302296 2.988036 1.225004
H  -4.44003 -3.070552 -0.345708
H  -5.161793 -1.535746 0.172084
H  -5.303754 -2.983387 1.229597
H  -2.615612 2.075858 0.468607
H  2.615673 -2.074284 0.479145
H  -4.79426 2.468955 0.080136
H  -4.594582 2.487375 -1.687828
H  4.799055 -2.462744 0.098955
H  4.592477 -2.498696 -1.667825
H  -6.495532 0.610292 -0.110488
H  -6.960846 1.940142 -1.211354
H  -6.160018 0.470972 -1.860001
H  6.500182 -0.607575 -0.11566
H  6.960232 -1.946009 -1.208324
H  6.156245 -0.481844 -1.864437
