program: Gaussian 09
title: 000227087
version: EM64L-G09RevD.01
frameworkgroup: C1[X(C14H18N2O4)]
method: RPBEPBE
basis: SDD
operation: Freq
keyword: #p
keyword: freq=noraman
keyword: PBEPBE/SDD
title: #p freq=noraman PBEPBE/SDD
converged: YES YES NO NO
title: Mulliken charges:
elementType: O O O O N N C C C C C C C C C C C C C C H H H H H H H H H H H H H H H H H H
charge: -0.289100 -0.289103 -0.232542 -0.232479 -0.115768 -0.115778 -0.384641 -0.397356 -0.384645 -0.397345 0.173840 0.173817 0.066718 0.066814 -0.022295 -0.022558 -0.230878 -0.230860 -0.678657 -0.678655 0.258051 0.244553 0.239143 0.257042 0.258032 0.244561 0.239136 0.257047 0.256726 0.196074 0.256687 0.196082 0.209215 0.218625 0.231318 0.209218 0.218630 0.231330
chargesum: 0.00000
title: Mulliken charges with hydrogens summed into heavy atoms:
elementType: O O O O N N C C C C C C C C C C C C C C
charge: -0.289100 -0.289103 -0.232542 -0.232479 -0.115768 -0.115778 0.117963 0.098829 0.117948 0.098838 0.173840 0.173817 0.066718 0.066814 -0.022295 -0.022558 0.221923 0.221909 -0.019499 -0.019477
polarizability: 2.36054792e+02 -1.62595158e+01 2.68831346e+02 1.05195180e-03 1.09643766e-02 1.08269162e+02
1716.lowfreq: -16.3123 -12.6691 -0.0009 -0.0008 -0.0005 6.8622 11.0304 14.2546 36.4474
frequency: -8.2272 -6.2564 36.4092 53.6650 67.4972 69.8184 75.3312 102.7759 110.1908 128.0246 134.8457 137.3196 174.9513 197.1212 199.3934 235.7923 239.5731 246.8259 262.4932 296.1343 304.3882 321.2817 337.5233 370.6390 386.8510 390.6128 441.8700 465.2973 496.9493 518.6941 543.7031 629.3601 720.3319 758.3862 768.0014 773.8553 776.2070 791.0564 799.1233 813.4268 813.5215 826.7537 831.7668 895.4156 925.4728 973.9480 976.4615 997.0434 1013.1976 1014.6218 1048.4399 1049.6947 1093.6936 1096.3648 1099.7963 1101.5467 1110.0516 1111.4374 1111.7404 1119.5446 1128.6309 1128.8899 1130.7612 1132.6670 1150.3285 1179.9899 1245.5291 1246.3068 1293.5098 1302.2273 1359.8377 1360.9398 1391.6507 1391.8081 1414.9164 1414.9277 1459.1174 1459.1205 1461.8950 1461.9027 1476.1830 1476.9025 1480.4504 1480.4921 1493.0319 1493.1450 1510.1952 1517.3167 1580.6087 1611.1455 2978.3876 2978.7366 2991.3369 2991.4495 3066.0652 3066.0987 3086.9997 3087.0597 3089.4395 3089.4569 3095.1181 3095.2127 3101.6617 3101.6738 3189.5439 3189.6180 3205.6975 3205.7661
redmass: 1.8746 1.9467 3.5390 4.5757 4.1491 4.0046 3.7812 2.7366 3.1848 3.8258 3.5191 3.0435 4.1195 3.9437 4.4477 1.1438 1.2200 4.8473 4.6719 4.6428 6.4285 4.6030 5.9281 9.2558 5.9153 6.2740 6.5777 9.3595 8.9878 5.9650 6.1349 9.9029 11.7689 4.6486 4.8977 1.1151 1.0308 4.7265 8.1777 1.0966 1.1165 4.9339 3.8570 7.4526 5.0614 3.9079 1.3308 1.1502 1.9143 2.3477 2.3410 4.0910 1.3733 1.5850 1.3324 1.3875 1.7498 1.9373 2.1608 1.5991 1.4097 1.4299 1.4998 1.5450 3.8551 4.5638 1.1740 1.1656 5.0213 4.6645 1.5130 1.4977 1.2786 1.2754 4.5477 4.4948 1.0428 1.0422 1.0768 1.0752 1.3166 1.2757 1.0649 1.0657 1.0989 1.0976 7.5301 8.1390 11.3593 10.9400 1.0626 1.0626 1.0364 1.0365 1.1005 1.1005 1.0496 1.0495 1.0974 1.0974 1.0600 1.0600 1.1021 1.1021 1.1190 1.1191 1.1174 1.1174
irintensity: 1.1932 0.0916 0.2140 8.0017 6.3961 2.0320 4.6405 0.0384 5.9671 7.1165 0.6633 0.3028 0.3550 3.1802 32.3384 0.5492 0.1104 0.7164 4.0828 6.4908 3.6610 11.9292 3.5152 13.9213 10.6578 0.0005 18.7577 0.3442 9.4744 0.0831 4.2146 4.9443 2.2586 3.3328 10.5823 4.7934 59.3280 17.8228 7.6799 5.8804 4.1251 16.3900 0.1838 5.2879 0.0538 251.1067 0.0760 0.2693 36.4400 16.0534 21.0940 283.6423 8.0870 0.6000 3.0840 0.1587 1.3390 5.0426 5.3093 81.0464 33.3837 2.1772 0.0663 19.4357 21.3588 122.2839 13.8522 1.6804 163.4604 7.3761 40.6352 0.2096 79.1516 0.0189 360.0888 13.2362 10.8616 15.1555 14.8730 0.7827 0.0015 139.4684 4.6198 4.9454 23.0583 3.2872 0.4212 580.6125 401.1173 0.9934 5.6735 90.3900 57.1824 2.4259 4.0820 2.1257 30.3239 0.1539 34.2924 29.9552 6.2513 62.5289 41.3372 36.5482 0.3492 1.2100 17.7362 25.3497
temp: 298.150 k
press: 1.00000 atm
elementType: 8 8 8 8 7 7 6 6 6 6 6 6 6 6 6 6 6 6 6 6 1 1 1 1 1 1 1 1 1 1 1 1 1 1 1 1 1 1
symmnumber: 1
zpe: 784929.6 jmol-1
zpe.correction: 0.298964 hartree
zpe.thermalcorrener: 0.318657 hartree
zpe.thermalcorrenthalpy: 0.319602 hartree
zpe.thermalcorrgfe: 0.250610 hartree
zpe.sumelectzpe: -953.027877 hartree
zpe.sumelectthermal: -953.008183 hartree
zpe.sumelectthermalent: -953.007239 hartree
zpe.sumelectthermalfe: -953.076230 hartree
dipole: 0.0011 0.0000 0.3229
dipole: 0.3229
quadrupole: -99.0909 -114.3252 -114.2276
quadrupole: -10.9922 0.0026 0.0032
quadrupole: 10.1236 -5.1106 -5.0130 -10.9922 0.0026 0.0032
hfenergy: -953.3268407 hartree
pointgroup: C01[X(C14H18N2O4)]
dipole: -0.000416 -0.000026 0.1270402 debye
polarizability: 239.3748162|-19.0307185|265.511322|-0.0000204|-0.0110147|108.2691623 unknown
InChI: InChI=1S/C14H18N2O4/c1-3-19-13-9(15-5-6-15)12(18)14(20-4-2)10(11(13)17)16-7-8-16/h3-8H2,1-2H3
charge 0 multiplicity 1
38 atoms
O  2.752023 0.811075 -0.05036
O  -2.751953 -0.811084 -0.050183
O  0.565414 2.683355 -0.179696
O  -0.565247 -2.683406 -0.179831
N  2.070511 -1.903268 0.12839
N  -2.070384 1.903225 0.128055
C  2.273041 -3.169464 -0.604339
C  3.366817 -2.0870 -0.55743
C  -2.273011 3.169243 -0.604955
C  -3.366768 2.086776 -0.557665
C  1.10126 -0.933197 0.009072
C  -1.101149 0.933125 0.008849
C  1.399627 0.430287 0.009231
C  -1.399531 -0.430355 0.009357
C  0.334036 1.427883 -0.059147
C  -0.333927 -1.427986 -0.058625
C  3.216505 1.84468 0.925679
C  -3.216702 -1.844144 0.926313
C  4.714216 2.015201 0.690232
C  -4.714406 -2.014572 0.690745
H  1.709876 -3.309705 -1.53251
H  2.3699 -4.065378 0.016355
H  4.234974 -2.224744 0.094902
H  3.547633 -1.4830 -1.452475
H  -1.709942 3.309266 -1.533217
H  -2.369816 4.065306 0.015533
H  -4.234854 2.224664 0.094732
H  -3.547677 1.48256 -1.452546
H  2.657855 2.778485 0.744545
H  3.002262 1.47891 1.950196
H  -2.658154 -2.778113 0.745744
H  -3.002558 -1.477876 1.950673
H  5.122581 2.767802 1.389595
H  5.251753 1.06342 0.846877
H  4.905384 2.359759 -0.340663
H  -5.122972 -2.766753 1.390443
H  -5.251835 -1.062636 0.846821
H  -4.905479 -2.359642 -0.339997
