program: Gaussian 09
title: 000227085
version: EM64L-G09RevD.01
frameworkgroup: C1[X(C7H7NO2)]
method: RPBEPBE
basis: SDD
operation: Freq
keyword: #pfreq=noraman
keyword: PBEPBE/SDD
title: #p freq=noraman PBEPBE/SDD
converged: YES YES NO YES
title: Mulliken charges:
elementType: O O N C C C C C C C H H H H H H H
charge: -0.281688 -0.243735 -0.001208 0.269407 -0.280198 -0.277888 0.197206 -0.320495 -0.321705 -0.498798 0.268960 0.269373 0.247423 0.245554 0.245936 0.235921 0.245935
chargesum: 0.00000
title: Mulliken charges with hydrogens summed into heavy atoms:
elementType: O O N C C C C C C C
charge: -0.281688 -0.243735 -0.001208 0.269407 -0.011238 -0.008515 0.197206 -0.073073 -0.076151 0.228995
polarizability: 1.20068484e+02 9.94366711e-01 9.36633897e+01 -1.11090734e-04 -7.91820295e-04 4.07155824e+01
1716.lowfreq: -9.4942 -7.3167 -0.0009 -0.0007 -0.0002 6.9858 57.6417 92.4540 116.2568
frequency: 57.6383 92.4352 116.2563 150.9251 205.7631 295.2396 342.8819 367.2423 458.8742 460.7820 654.2381 659.4861 689.6869 751.6854 772.5255 848.6089 899.2311 921.8735 958.4369 984.6060 989.9178 1058.6901 1069.7410 1089.9319 1115.0117 1151.5526 1210.9877 1256.0527 1302.0433 1323.9651 1399.9270 1424.4521 1452.4014 1461.0868 1463.0440 1554.6722 1582.0615 1628.9090 3006.8978 3109.0799 3139.5230 3142.5694 3153.7735 3172.8253 3186.5250
redmass: 4.3168 1.2526 2.9095 4.1138 5.3700 4.7822 6.3325 2.4959 4.8905 7.2433 6.9166 6.9705 4.2730 3.0907 5.9776 1.5808 1.2518 7.8513 6.5331 1.4152 1.4352 2.6698 2.1197 2.2032 1.2649 1.4926 1.3505 3.7453 8.0911 1.4595 1.8950 1.1873 1.0491 1.9500 1.0542 8.0682 5.6891 10.1750 1.0296 1.1046 1.0883 1.0919 1.1049 1.0963 1.0960
irintensity: 1.0213 0.4379 0.0156 0.5098 13.7309 20.9689 0.2966 0.0000 3.8418 3.9792 14.7159 1.8556 38.1485 13.4299 7.0539 37.9564 0.1751 11.2851 1.5092 0.8535 0.6599 54.2720 54.4734 47.6346 0.0262 44.8358 22.4997 245.5341 1.4446 8.4532 28.0993 26.9057 15.3105 3.6929 10.5213 33.6998 6.2609 147.5438 31.4361 24.3747 28.6197 4.6427 14.1958 7.0532 3.1472
temp: 298.150 k
press: 1.00000 atm
elementType: 8 8 7 6 6 6 6 6 6 6 1 1 1 1 1 1 1
symmnumber: 1
zpe: 335756.2 jmol-1
zpe.correction: 0.127883 hartree
zpe.thermalcorrener: 0.136899 hartree
zpe.thermalcorrenthalpy: 0.137844 hartree
zpe.thermalcorrgfe: 0.093029 hartree
zpe.sumelectzpe: -475.408680 hartree
zpe.sumelectthermal: -475.399663 hartree
zpe.sumelectthermalent: -475.398719 hartree
zpe.sumelectthermalfe: -475.443534 hartree
dipole: -2.4829 -1.4169 -0.0002
dipole: 2.8588
quadrupole: -57.6849 -55.4295 -59.0314
quadrupole: 7.3247 0.0002 -0.0013
quadrupole: -0.3030 1.9524 -1.6494 7.3247 0.0002 -0.0013
hfenergy: -475.5365628 hartree
pointgroup: C01 [X(C7H7N1O2)]
dipole: -0.9662969 -0.575555 -0.0000911 debye
dipolederiv: -1.2444647 -0.3446706 -0.0000847 -0.6094965 -0.7970243 -0.0000533 -0.0000464 0.0000181 -0.2920533 -0.7528943 0.2462986 -0.0000873 0.0059361 -0.8466319 0.0000564 -0.0000644 0.0000342 -0.319284 -0.3339235 0.0062666 -0.000012 0.0094505 -0.2546897 0.000008 -0.0000235 0.0000053 -0.2459895 -0.3550341 0.0417065 -0.0000479 0.0391188 0.0786788 -0.0000221 -0.0000626 -0.0000231 0.0139826 -0.185137 -0.236221 0.000035 0.0729853 -0.041349 0.0000032 -0.0000297 -0.0000259 -0.0630213 -0.1164044 0.2417081 -0.0000557 -0.034605 -0.1113092 0.0000053 -0.0000272 0.0000545 -0.0647831 1.696103 0.0247418 0.0001972 0.4775017 1.3195219 -0.0000156 0.0001729 -0.0000696 0.2330668 0.2334938 0.3104306 -0.0000247 0.1172444 0.1756118 -0.0000431 0.0000198 -0.0000149 -0.0754151 0.1127292 -0.2852905 0.0000878 -0.1051184 0.2890249 -0.0000977 0.0000563 -0.0001255 -0.0748483 0.7037223 0.1358416 0.0000288 0.0744349 0.2410115 0.000013 0.000039 0.0000152 0.2796422 0.1189257 0.0696365 -0.0000212 0.0303449 0.00594 0.0000384 -0.000018 0.0000373 0.1564187 0.0887629 -0.079277 0.0000089 -0.0700218 0.0280876 0.000019 0.0000084 0.0000135 0.155748 0.0134204 -0.1002269 0.0000063 -0.0851841 -0.0448892 0.0000293 0.0000025 0.0000261 0.1383726 0.0555441 0.0693561 -0.0000263 0.0588569 -0.0907906 0.0000589 -0.0000205 0.000063 0.1368356 -0.0320051 -0.0270162 0.0165045 0.0647794 0.0639016 -0.0987286 0.0619914 -0.0669327 -0.0511654 0.0291514 -0.0462567 -0.0000056 -0.1109838 -0.0790277 0.0000079 0.0000046 0.0000165 0.1237003 -0.0319898 -0.0270275 -0.0165031 0.0647566 0.0639337 0.0987208 -0.0620026 0.0669079 -0.0512068 unknown
polarizability: 120.0222599|1.48565|93.7096109|0.0100127|-0.0096632|40.7155855 unknown
InChI: InChI=1S/C7H7NO2/c1-10-7(9)6-2-4-8-5-3-6/h2-5H,1H3
charge 0 multiplicity 1
17 atoms
O  -2.108572 -0.821225 -0.000382
O  -1.908677 1.500953 -0.000494
N  2.91976 -0.274039 0.000303
C  0.098885 0.109327 -0.000174
C  0.979397 1.219468 -0.000287
C  0.649334 -1.196203 0.000188
C  -1.374738 0.36562 -0.00043
C  2.370417 0.978918 -0.000049
C  2.055147 -1.333702 0.000419
C  -3.582272 -0.659442 -0.000503
H  0.573975 2.235611 -0.00055
H  -0.004631 -2.071445 0.00028
H  3.083433 1.810471 -0.000138
H  2.520145 -2.325622 0.000708
H  -3.904142 -0.10674 0.897982
H  -3.976748 -1.684651 -0.00044
H  -3.904011 -0.1069 -0.899134
