program: Gaussian 09
title: 000227075
version: EM64L-G09RevD.01
frameworkgroup: C1[X(C10H2Cl8O)]
method: RPBEPBE
basis: SDD
operation: Freq
keyword: #p
keyword: freq=noraman
keyword: PBEPBE/SDD
title: #p freq=noraman PBEPBE/SDD
converged: YES YES NO NO
title: Mulliken charges:
elementType: Cl Cl Cl Cl Cl Cl Cl Cl O C C C C C C C C C C H H
charge: 0.077028 0.083601 0.089601 0.102233 0.093756 0.097763 0.072796 0.054525 -0.056148 -0.134369 -0.137795 -0.347018 -0.301720 0.232228 -0.442061 0.003643 0.014961 0.007853 -0.094981 0.294866 0.289239
chargesum: 0.00000
title: Mulliken charges with hydrogens summed into heavy atoms:
elementType: Cl Cl Cl Cl Cl Cl Cl Cl O C C C C C C C C C C
charge: 0.077028 0.083601 0.089601 0.102233 0.093756 0.097763 0.072796 0.054525 -0.056148 -0.134369 -0.137795 -0.347018 -0.301720 0.232228 0.142045 0.003643 0.014961 0.007853 -0.094981
polarizability: 1.99935125e+02 -1.64551400e+00 2.01371062e+02 2.17401069e+01 6.68577683e+00 1.36832498e+02
1716.lowfreq: -1.6736 -0.0020 -0.0018 0.0011 6.6690 7.0348 35.3473 56.8732 86.2438
frequency: 35.3129 56.8702 86.2418 88.4077 100.7373 114.2933 139.5298 141.1379 152.6517 158.3496 163.0807 169.1764 181.0611 189.5634 224.0723 238.4822 247.1280 265.7654 312.1495 326.9210 331.9004 337.1821 357.1329 449.5833 473.0916 488.7569 514.9961 548.9163 558.5847 604.8320 638.7793 669.8871 717.5548 733.2802 790.8160 803.4119 835.1210 875.4733 883.1020 909.1294 937.4903 992.1141 1013.4211 1055.5891 1087.1486 1122.4522 1137.1865 1158.0390 1183.2180 1191.8392 1295.1661 1457.5813 1578.7948 1639.3370 1750.1269 3013.6878 3076.7747
redmass: 17.4048 22.7525 22.9743 32.9815 26.3967 14.7088 29.9469 30.4785 28.6376 33.4514 27.2356 32.3503 32.3171 14.4916 17.9690 17.2891 19.0427 4.0048 15.5659 11.2859 14.9093 9.9198 19.7892 15.1224 10.3606 7.3775 9.1124 8.3872 8.1946 11.9196 11.5072 12.1653 6.6123 10.5026 10.4797 11.1117 11.1963 9.0073 5.4908 7.7069 6.8459 5.1976 4.2083 9.4274 4.5231 3.9896 9.0907 11.9322 2.7525 2.0117 1.6811 1.0859 12.0353 9.3321 13.1298 1.0626 1.0999
irintensity: 0.3368 0.0355 0.3114 0.0041 0.2244 1.2286 0.2102 0.0545 0.1707 0.0724 0.1914 0.0332 0.0278 2.5208 0.6691 0.8783 0.3028 3.2593 0.4910 1.8118 0.1723 1.2072 1.5787 15.0342 12.0805 16.9339 14.6817 15.4644 3.1455 24.6721 8.6515 50.8732 46.6861 19.2260 2.0343 25.0507 16.0068 0.9494 19.1648 38.7728 42.4053 56.4924 8.9511 4.7509 8.1926 24.5952 20.8422 42.0345 61.7805 25.4816 29.9165 22.6772 85.4602 71.3485 177.3482 0.8963 0.0753
temp: 298.150 k
press: 1.00000 atm
elementType: 17 17 17 17 17 17 17 17 8 6 6 6 6 6 6 6 6 6 6 1 1
symmnumber: 1
zpe: 242856.5 jmol-1
zpe.correction: 0.092499 hartree
zpe.thermalcorrener: 0.111506 hartree
zpe.thermalcorrenthalpy: 0.112450 hartree
zpe.thermalcorrgfe: 0.043941 hartree
zpe.sumelectzpe: -4136.520103 hartree
zpe.sumelectthermal: -4136.501096 hartree
zpe.sumelectthermalent: -4136.500152 hartree
zpe.sumelectthermalfe: -4136.568660 hartree
dipole: 0.0536 -1.5603 0.8724
dipole: 1.7884
quadrupole: -161.6330 -159.4175 -171.7141
quadrupole: 4.3692 -0.2881 -1.0831
quadrupole: 2.6219 4.8374 -7.4592 4.3692 -0.2881 -1.0831
hfenergy: -4136.6126018 hartree
pointgroup: C01 [X(C10H2Cl8O1)]
dipole: -0.060657 -0.6206371 0.3258973 debye
dipolederiv: -0.1796908 0.048221 -0.0725143 0.0317729 -0.1521938 0.1649927 -0.0630612 0.2082755 -0.4216947 -0.2286395 -0.0885773 -0.0439059 -0.1144606 -0.2337404 -0.2283756 -0.1171327 -0.2875101 -0.4599048 -0.1567398 0.0716515 0.0572088 0.0939443 -0.50054 -0.1361815 0.0694623 -0.1533019 -0.1238579 -0.1119762 0.0788995 -0.014053 0.0781749 -0.4240496 0.174789 -0.0075536 0.1809584 -0.1406918 -0.5199417 0.2713944 -0.1676008 0.2217304 -0.1289832 0.0710869 -0.2250716 0.1188781 -0.0080381 -0.2732598 -0.3357028 -0.1040375 -0.283093 -0.3854038 -0.1064546 -0.1378655 -0.1740378 0.0088848 -0.2334042 0.2965764 -0.0208398 0.2367533 -0.4105712 0.0057536 -0.038029 0.012948 0.0380638 -0.7702773 -0.2209721 -0.1938502 -0.1422266 -0.109052 -0.0404436 -0.2110232 -0.0634677 -0.0222991 -0.1881894 0.0207376 -0.1664948 0.0185976 -0.2711319 -0.0619405 -0.2435518 -0.0719412 -0.9637979 0.1976362 -0.0748855 0.0646132 -0.0239799 -0.0202892 -0.2317289 0.1014125 -0.3317265 0.6040566 0.4239112 0.3654891 0.0708633 0.2652399 -0.0074445 0.3032107 0.0743635 0.4212856 0.6551395 0.0153222 -0.0956822 -0.3199842 0.0197111 0.5896443 0.4067041 -0.2281595 0.4696371 -0.0508368 0.0442485 -0.1869906 -0.1210332 -0.2441849 0.420767 -0.5307228 -0.0661247 -0.5284409 0.019485 0.2140293 -0.0570102 0.4351712 -0.0689282 0.4125312 0.0935547 0.3678334 0.0819031 1.1447811 -0.1827062 -0.0525356 -0.0659629 -0.0382041 -0.1309143 0.0100135 -0.0547308 0.0047377 -0.0019037 0.6495061 -0.3701117 0.2850418 -0.4757634 0.0152324 -0.2001562 0.2736942 -0.2955893 -0.0428362 0.2078793 0.4761288 0.1385996 0.5530185 0.4727212 0.2674313 0.0963171 0.3552316 -0.0737098 -0.1026011 -0.6210889 -0.0666676 -0.5096288 0.5279641 -0.0834205 0.102133 -0.0700828 -0.2124247 1.0296271 0.4075415 0.2868874 0.3778624 0.2397307 0.10956 0.3026582 0.0983169 -0.02179 0.0538484 0.0137222 0.0287019 -0.0151269 0.0352904 0.0453888 0.0192538 0.0726533 0.0627567 0.1114177 0.053195 -0.0101429 0.0187911 0.0604329 -0.0330611 -0.0148242 -0.048727 0.010618 unknown
polarizability: 195.8746972|-2.439495|201.4227244|26.7524554|5.9164241|140.8412641 unknown
InChI: InChI=1S/C10H2Cl8O/c11-2-1-7(15)8(16)4(13)5(14)9(17,6(8)19)10(7,18)3(2)12/h1H2
charge 0 multiplicity 1
21 atoms
Cl 0.308843 -1.647666 2.290221
Cl -0.313222 1.492867 2.206585
Cl 1.27681 -2.834144 -1.013365
Cl 0.077964 2.755548 -1.220723
Cl 3.653398 -1.129073 0.677421
Cl 2.904712 2.309971 0.560732
Cl -2.98905 2.106729 0.147254
Cl -4.216832 -1.029185 -0.470039
O  0.247852 -0.185269 -2.676186
C  -0.23698 -1.016425 0.621616
C  -0.580362 0.575941 0.589055
C  0.947482 -1.137856 -0.401101
C  0.451525 1.128581 -0.480893
C  0.480269 -0.087646 -1.475866
C  -1.538864 -1.755035 0.187654
C  2.166023 -0.367887 0.10268
C  1.873593 0.966822 0.059159
C  -2.04092 0.599341 0.214887
C  -2.538731 -0.645136 -0.001195
H  -1.867863 -2.468082 0.961714
H  -1.379547 -2.331396 -0.742412
