program: Gaussian 09
title: 000227069
version: EM64L-G09RevD.01
frameworkgroup: C1[X(C9H7Cl4NS)]
method: RPBEPBE
basis: SDD
operation: Freq
keyword: #p
keyword: freq=noraman
keyword: PBEPBE/SDD
title: #p freq=noraman PBEPBE/SDD
converged: NO NO NO NO
title: Mulliken charges:
elementType: Cl Cl Cl Cl S N C C C C C C C C C H H H H H H H
charge: 0.008769 0.005936 0.055226 0.058393 0.122312 0.302100 -0.219609 -0.020708 -0.165954 -0.481532 -0.461963 -0.029677 -0.034976 -0.449263 -0.610860 0.292995 0.303661 0.262449 0.259715 0.276935 0.265682 0.260369
chargesum: 0.00000
title: Mulliken charges with hydrogens summed into heavy atoms:
elementType: Cl Cl Cl Cl S N C C C C C C C C C
charge: 0.008769 0.005936 0.055226 0.058393 0.122312 0.302100 -0.219609 0.272286 -0.165954 0.084579 0.074687 -0.029677 -0.034976 0.076788 -0.610860
polarizability: 1.79980322e+02 7.73155083e+00 1.61054243e+02 5.24207505e+00 -4.51074561e-01 1.17012702e+02
1716.lowfreq: -7.4930 -0.0009 0.0011 0.0024 1.7044 7.7601 10.1314 14.7916 65.5819
frequency: -2.7030 13.3087 65.5763 84.9876 94.1865 138.4906 147.3161 151.7590 156.0561 172.4242 187.7180 260.9925 310.0677 343.2740 351.9471 389.7368 393.2585 395.3212 415.4356 458.5421 527.2427 531.0808 561.7887 600.9308 666.3507 732.0380 808.7991 834.3456 852.5545 902.5659 921.5715 959.4765 1005.8247 1042.2922 1067.7656 1082.4675 1087.2872 1096.6027 1122.3915 1139.9068 1171.3851 1220.5712 1233.0489 1259.9875 1265.4129 1283.5223 1324.8486 1360.0285 1463.4051 1470.1945 1481.4491 1592.0236 2218.9500 2971.7502 3020.1434 3036.5928 3043.4727 3053.2253 3106.8420 3142.6964
redmass: 15.0239 14.5395 13.9651 14.7069 11.5295 8.5979 10.8134 10.9259 4.9054 6.4386 6.8444 7.6973 9.7384 16.2399 5.1730 3.7316 11.9710 10.7541 4.8178 2.7093 5.5237 5.0522 3.4084 10.6227 7.0924 5.7859 4.9145 3.2775 3.2952 1.9936 3.2573 2.6605 2.3561 2.8019 3.5745 2.4106 3.6492 2.6532 4.9801 3.5503 1.7723 1.6855 1.2913 1.3182 1.4973 1.4350 1.2556 1.3236 1.0807 1.0827 1.1012 11.6715 12.2721 1.0572 1.0983 1.0647 1.0849 1.0620 1.1062 1.1084
irintensity: 0.3444 0.5169 0.1510 1.0850 1.4401 1.9739 1.0195 0.4744 0.3747 3.6086 1.7085 4.6934 0.9460 3.8751 6.6733 8.4341 0.1920 0.6519 8.0339 4.8895 11.7321 1.7645 18.3786 7.2623 30.0328 55.5949 30.1041 2.7688 4.6080 7.2958 35.3699 17.7754 25.5637 10.3724 25.1001 13.0395 5.3233 12.7876 1.2699 1.0258 4.8317 2.0043 5.2474 26.3892 9.1995 57.3949 16.4854 29.0845 2.6983 31.5340 4.4985 52.0814 1072.8540 24.2632 2.3954 9.9775 10.1953 10.5661 7.9686 7.4127
temp: 298.150 k
press: 1.00000 atm
elementType: 17 17 17 17 16 7 6 6 6 6 6 6 6 6 6 1 1 1 1 1 1 1
symmnumber: 1
zpe: 369605.6 jmol-1
zpe.correction: 0.140775 hartree
zpe.thermalcorrener: 0.155388 hartree
zpe.thermalcorrenthalpy: 0.156332 hartree
zpe.thermalcorrgfe: 0.096284 hartree
zpe.sumelectzpe: -2639.069643 hartree
zpe.sumelectthermal: -2639.055031 hartree
zpe.sumelectthermalent: -2639.054087 hartree
zpe.sumelectthermalfe: -2639.114134 hartree
dipole: 1.9360 0.7872 -1.1893
dipole: 2.4046
quadrupole: -146.6051 -128.2452 -118.8281
quadrupole: -2.8711 0.6324 1.5341
quadrupole: -15.3790 2.9809 12.3980 -2.8711 0.6324 1.5341
hfenergy: -2639.2104183 hartree
pointgroup: C01 [X(C9H7Cl4N1S1)]
dipole: 0.7804255 0.3793591 -0.3768709 debye
dipolederiv: -0.2137847 0.0462781 -0.0374537 0.0461191 -0.583874 0.2273389 -0.0213315 0.2238171 -0.2538172 -0.3611594 0.2443306 0.0359524 0.280721 -0.5356433 -0.0672582 0.0399253 -0.0625261 -0.1477081 -0.0383794 0.0959588 0.0158061 0.0667232 -0.4019188 -0.2660762 0.014414 -0.3916443 -0.2950296 -0.0380779 0.0714027 -0.1526688 0.1202321 -0.1441751 0.1851029 -0.2966529 0.2606433 -0.5197078 -0.912122 -0.3614999 -0.0547531 -0.5121529 -0.3235087 -0.0337559 -0.0998634 -0.0434491 -0.1035398 -1.9846961 -0.8127382 -0.1077037 -0.9502301 -0.6165528 -0.0862417 -0.0919442 -0.0780626 -0.1831513 0.2580697 0.0186166 0.0882317 0.0269723 0.7826108 -0.4932464 0.1237985 -0.3323766 0.3344057 0.012764 0.0366015 -0.0315895 -0.103623 -0.0974565 0.0755981 -0.0945026 0.0528577 -0.0010097 0.5592458 -0.3960504 -0.1186564 -0.3473854 0.7438468 0.2285411 -0.0405296 0.1247213 0.1332191 -0.0928652 0.0801212 -0.0042368 0.0672065 -0.2376801 0.0575275 0.0160535 0.0669704 0.0219779 -0.0783588 0.0186868 0.052534 0.0995937 -0.1712627 -0.0423384 -0.0207542 -0.0716548 0.0316233 -0.0533096 -0.209685 -0.023981 -0.1229302 0.3464269 0.5217139 -0.04503 0.5845241 0.1984325 -0.1507765 0.0132813 0.2768745 -0.1288129 0.0917379 -0.3850277 0.3926486 -0.4248778 0.595879 0.9615639 0.2863529 0.0772084 0.3427955 0.3593987 0.0194517 0.0372255 0.0055352 0.2611656 2.10359 1.0375963 0.1766695 1.2871652 0.5921278 0.1088788 0.2294486 0.1152546 -0.0221948 -0.0000864 0.034351 -0.0672778 0.0212044 0.0589902 -0.0279753 -0.0391495 0.0120007 -0.0700278 -0.0659817 -0.0464806 0.0163793 -0.0354556 0.0567817 0.0079202 -0.0066992 -0.0018729 0.0847636 0.0874306 -0.0147044 -0.063784 -0.0150165 0.077768 -0.0519349 -0.0518585 -0.0449256 -0.069064 0.0526666 0.0019663 0.046287 -0.0492917 0.0334853 0.0377261 0.0792902 0.0755839 -0.0265655 0.0566359 -0.0512754 -0.0465828 -0.0086682 0.0023497 -0.0543986 -0.0238607 -0.0868482 -0.0109099 -0.0434954 -0.0180076 -0.0182061 -0.0409539 -0.085649 -0.0029966 -0.0094904 0.0284666 0.0993086 -0.0588735 -0.0751024 -0.0590491 -0.0442124 0.0521972 0.0414505 -0.0911376 -0.0121367 -0.0580498 unknown
polarizability: 175.2608788|10.1253653|163.1126489|13.212472|-0.2972107|119.6737395 unknown
InChI: InChI=1S/C9H7Cl4NS/c10-6-7(11)9(13)3-8(6,12)1-5(9)2-14-4-15/h5H,1-3H2
charge 0 multiplicity 1
22 atoms
Cl 0.614123 2.692047 -1.587884
Cl 2.600191 -2.580778 -0.618301
Cl 1.172921 2.348519 1.790843
Cl 2.370939 -0.942075 2.395014
S  -5.224677 -1.55269 -0.269056
N  -2.816682 -0.075413 0.003803
C  0.806868 1.019714 -0.804313
C  -0.51643 0.157829 -0.835029
C  1.580054 -1.045403 -0.426835
C  1.807903 0.055213 -1.503493
C  0.032265 -1.290234 -0.534669
C  1.364989 1.01769 0.623056
C  1.83311 -0.240705 0.854217
C  -1.604317 0.661795 0.142493
C  -3.841564 -0.696585 -0.111752
H  -0.920464 0.204922 -1.862218
H  2.836921 0.441052 -1.518454
H  1.482113 -0.252247 -2.510419
H  -0.375865 -1.720556 0.394477
H  -0.183247 -1.984489 -1.362858
H  -1.799755 1.73525 -0.052869
H  -1.244595 0.578043 1.186848
