program: Gaussian 09
title: 000227067
version: EM64L-G09RevD.01
frameworkgroup: C1[X(C8H5Cl4N)]
method: RPBEPBE
basis: SDD
operation: Freq
keyword: #p
keyword: freq=noraman
keyword: PBEPBE/SDD
title: #p freq=noraman PBEPBE/SDD
converged: NO YES NO NO
title: Mulliken charges:
elementType: Cl Cl Cl Cl N C C C C C C C C H H H H H
charge: 0.029347 0.010794 0.070623 0.062511 0.012901 -0.206408 -0.168789 -0.473982 -0.079113 -0.466063 -0.029099 -0.004885 -0.188220 0.309864 0.261987 0.304915 0.277459 0.276159
chargesum: 0.00000
title: Mulliken charges with hydrogens summed into heavy atoms:
elementType: Cl Cl Cl Cl N C C C C C C C C
charge: 0.029347 0.010794 0.070623 0.062511 0.012901 -0.206408 -0.168789 0.097868 0.225802 0.087555 -0.029099 -0.004885 -0.188220
polarizability: 1.51918634e+02 -5.17455802e+00 1.11255543e+02 1.24163623e+00 6.46900175e+00 9.33231911e+01
1716.lowfreq: -4.4364 -0.0025 -0.0011 0.0007 4.6995 9.2187 62.0031 85.7086 100.9965
frequency: 62.0002 85.7085 100.9942 135.4679 151.6088 153.6731 169.1767 186.2716 267.8726 289.3148 340.9476 349.3277 382.3803 393.9623 461.3797 503.8010 532.3712 566.7480 582.0226 608.1925 729.0077 786.2848 834.0181 865.7067 915.7782 936.0683 989.7551 1008.2807 1056.2692 1067.3563 1087.9146 1089.4444 1113.2567 1162.2412 1220.2184 1224.2120 1258.8333 1273.5061 1313.8665 1467.8588 1481.0247 1591.6690 2204.4876 3029.7673 3048.2840 3053.5451 3124.7184 3144.7157
redmass: 15.0941 24.0908 14.7143 10.7393 22.6438 26.6946 9.3312 9.6050 3.7955 8.6006 25.7357 13.1494 3.3537 8.0668 5.3416 5.3908 3.8541 6.0314 5.0569 8.9430 5.4763 3.7562 3.7255 5.9979 3.3568 3.4826 2.4636 3.7502 2.9389 2.8352 1.8639 3.4540 3.2599 1.6022 1.6842 1.6148 1.5265 1.4584 1.4535 1.0832 1.0987 11.7371 12.5558 1.0828 1.0612 1.0622 1.1069 1.1075
irintensity: 2.1678 0.8256 2.7553 1.5574 0.2992 0.0312 1.8111 1.7075 0.5491 0.2704 1.1260 0.8355 4.8872 7.7303 5.4078 3.9297 7.3819 16.9829 10.1157 6.4638 50.5302 14.9043 5.7839 17.0022 20.4874 18.9531 31.0202 6.3647 21.0416 22.8991 3.1078 3.0120 10.3820 2.3617 3.0308 0.9083 31.4467 60.0463 7.1297 14.2745 7.7661 55.9863 6.1724 1.0534 5.9982 11.8258 3.9971 5.6410
temp: 298.150 k
press: 1.00000 atm
elementType: 17 17 17 17 7 6 6 6 6 6 6 6 6 1 1 1 1 1
symmnumber: 1
zpe: 289504.1 jmol-1
zpe.correction: 0.110266 hartree
zpe.thermalcorrener: 0.122718 hartree
zpe.thermalcorrenthalpy: 0.123662 hartree
zpe.thermalcorrgfe: 0.070327 hartree
zpe.sumelectzpe: -2201.843470 hartree
zpe.sumelectthermal: -2201.831019 hartree
zpe.sumelectthermalent: -2201.830074 hartree
zpe.sumelectthermalfe: -2201.883409 hartree
dipole: 1.9225 -3.2016 -1.3212
dipole: 3.9613
quadrupole: -115.1591 -96.4244 -108.8885
quadrupole: 1.7719 7.1528 -2.9743
quadrupole: -8.3351 10.3996 -2.0645 1.7719 7.1528 -2.9743
hfenergy: -2201.9537363 hartree
pointgroup: C01 [X(C8H5Cl4N1)]
dipole: -0.824143 1.0684687 -0.7798266 debye
dipolederiv: -0.3880001 0.0308533 0.2620591 0.0296522 -0.1511748 -0.0617523 0.2554898 -0.059262 -0.4151473 -0.6656442 0.1926527 0.0239148 0.1708024 -0.2232293 -0.02676 0.024154 -0.0263951 -0.1472162 -0.2012507 0.2617793 0.022831 0.3066565 -0.4740737 0.0291473 -0.0506714 0.1234115 0.029419 -0.2136245 -0.1343891 0.2241623 -0.2117864 -0.1953144 0.2249041 0.3554554 0.2206028 -0.2865087 -0.2439498 -0.0487525 -0.0076921 0.0052716 -0.1762782 0.0020877 -0.0583973 -0.0396444 -0.2089061 0.5281773 0.1192201 -0.4182262 0.0754555 0.1983386 0.2183289 -0.3730838 0.0980455 0.7199097 0.9405152 -0.367967 0.0541814 -0.1722261 0.3462304 0.0782048 0.0494998 0.0794775 0.1420536 -0.2316856 0.0691474 0.0866409 0.0487051 0.0285018 -0.0534331 0.0609274 -0.0661833 -0.0859299 -0.0129029 0.0416548 0.0778386 -0.0336186 0.1421903 0.0050922 0.0329239 -0.0051374 0.0132202 -0.0947753 0.0262963 -0.064006 0.0647285 -0.0358979 -0.0801775 -0.0202791 -0.0017928 -0.0157945 0.2145917 -0.4574558 0.0713372 -0.4089184 0.5376599 -0.0948929 0.1885978 -0.1160445 -0.2974174 0.0703424 0.3251186 -0.3936557 0.262976 0.1058352 -0.290721 -0.5527521 -0.2781912 0.3700078 0.0474206 0.0127833 0.0820318 -0.0674193 -0.0706552 -0.0751104 0.1473416 -0.0044934 0.0143679 0.0339316 -0.0317804 -0.0469871 -0.0377435 0.0378103 -0.061909 -0.0353397 -0.0430222 0.027067 0.0944685 -0.0253986 0.0146178 -0.0172779 -0.0766151 0.0778002 0.0133467 0.0616182 0.0706736 0.0033242 -0.0263598 -0.0076198 -0.0520143 0.0050666 0.0682709 -0.030006 0.0330312 0.0490861 0.0611527 0.0120482 0.0155517 -0.0067168 0.0966926 0.0380155 -0.0124766 0.0014012 -0.0556979 0.0579091 0.0005492 0.00302 0.0434737 -0.0950872 0.0029047 0.0052695 0.0225781 0.0768131 unknown
polarizability: 144.3598845|-15.8399131|107.0533883|-13.573906|-6.8351199|105.0840947 unknown
InChI: InChI=1S/C8H5Cl4N/c9-5-6(10)8(12)3-7(5,11)1-4(8)2-13/h4H,1,3H2
charge 0 multiplicity 1
18 atoms
Cl 1.78075 -0.263316 -2.347585
Cl -3.171494 1.23936 0.066888
Cl 0.953666 -2.645246 -0.005117
Cl -2.107804 -1.687087 1.522823
N  2.853585 0.407174 1.73838
C  0.520584 0.061166 -1.035011
C  -1.417944 0.660507 -0.084856
C  -0.823794 0.673563 -1.5206
C  0.977911 1.1690 0.012956
C  -0.397639 1.559162 0.700338
C  0.019287 -1.161328 -0.261818
C  -1.160158 -0.795818 0.31582
C  2.01504 0.732363 0.95552
H  -1.360798 0.014878 -2.216733
H  -0.717361 1.688203 -1.938082
H  1.372283 2.027005 -0.561767
H  -0.411329 1.343961 1.779081
H  -0.626485 2.625455 0.543462
