program: Gaussian 09
title: 000227059
version: EM64L-G09RevD.01
frameworkgroup: C1[X(C10H4Cl8)]
method: RPBEPBE
basis: SDD
operation: Freq
keyword: #pfreq=noraman
keyword: PBEPBE/SDD
title: #p freq=noraman PBEPBE/SDD
converged: NO YES NO NO
title: Mulliken charges:
elementType: Cl Cl Cl Cl Cl Cl Cl Cl C C C C C C C C C C H H H H
charge: 0.067961 0.077656 0.046103 0.058939 0.074812 0.078688 0.066847 0.042414 -0.132215 -0.130865 -0.196665 -0.168149 -0.509565 -0.451992 -0.007118 0.008432 -0.010918 -0.093896 0.291301 0.315317 0.294411 0.278503
chargesum: 0.00000
title: Mulliken charges with hydrogens summed into heavy atoms:
elementType: Cl Cl Cl Cl Cl Cl Cl Cl C C C C C C C C C C
charge: 0.067961 0.077656 0.046103 0.058939 0.074812 0.078688 0.066847 0.042414 -0.132215 -0.130865 -0.196665 -0.168149 0.097053 0.120921 -0.007118 0.008432 -0.010918 -0.093896
polarizability: 1.95518214e+02 -3.53405154e+00 2.00823982e+02 1.71010801e+01 5.81594479e+00 1.27274619e+02
1716.lowfreq: -5.9556 -0.0017 -0.0013 0.0020 6.0509 9.1560 45.6914 61.8332 92.7767
frequency: 45.6593 61.8274 92.7764 97.6118 105.6445 142.7441 145.1043 150.9319 153.7177 162.8664 166.3582 180.5467 185.2344 223.5647 242.5049 268.0026 315.9304 327.3927 332.1785 338.4482 351.2796 395.6130 445.1154 481.6238 503.7072 528.6054 541.7233 577.3091 588.7022 620.4383 682.1168 719.4316 764.7319 823.1709 851.2134 885.3628 901.0658 932.3989 942.4016 998.7063 1011.7570 1057.0985 1074.2485 1088.7301 1107.7791 1120.3103 1154.9093 1173.4673 1181.2671 1206.7867 1261.7753 1290.9319 1458.1501 1483.0590 1602.2783 1639.0129 3008.5204 3060.9291 3074.0790 3144.6695
redmass: 21.1537 19.1176 32.7800 26.8205 20.4094 28.2701 29.0471 30.2685 33.7645 24.1461 31.8088 31.3479 15.2597 13.2588 17.4019 4.4103 17.3971 6.5835 25.0542 6.6294 10.5230 4.4551 5.4865 7.6470 6.4310 7.1610 8.1349 7.8855 7.0019 6.4982 4.9991 7.1671 5.6435 6.8709 5.3778 7.6014 4.7676 6.0351 4.6784 3.7997 2.7714 3.2114 6.5526 3.1551 3.2354 3.7417 4.7308 3.7124 1.6378 2.4496 1.4750 1.6903 1.0888 1.0907 11.7883 9.2563 1.0634 1.0611 1.0987 1.1073
irintensity: 0.1449 0.1790 0.0007 0.4501 0.5524 0.2854 0.1087 0.2308 0.0444 0.0644 0.1276 0.0188 2.6102 0.1951 0.2094 3.0637 0.1518 0.2802 0.5095 2.5358 0.2136 13.4451 5.7363 13.6013 29.8259 5.0507 24.4795 8.3095 32.3215 7.4159 17.3448 40.7772 7.1528 39.5700 7.1389 32.8931 8.4038 22.6247 23.7722 50.0456 4.4613 23.2137 4.9375 22.1664 39.3543 14.8767 1.6198 17.1560 29.4590 21.6442 57.4942 30.8586 18.9242 19.7764 68.3644 61.7990 2.1290 5.3712 0.1253 3.5995
temp: 298.150 k
press: 1.00000 atm
elementType: 17 17 17 17 17 17 17 17 6 6 6 6 6 6 6 6 6 6 1 1 1 1
symmnumber: 1
zpe: 295917.4 jmol-1
zpe.correction: 0.112709 hartree
zpe.thermalcorrener: 0.130695 hartree
zpe.thermalcorrenthalpy: 0.131639 hartree
zpe.thermalcorrgfe: 0.065734 hartree
zpe.sumelectzpe: -4062.571801 hartree
zpe.sumelectthermal: -4062.553816 hartree
zpe.sumelectthermalent: -4062.552872 hartree
zpe.sumelectthermalfe: -4062.618777 hartree
dipole: -0.6128 -1.8671 -1.9314
dipole: 2.7554
quadrupole: -162.2168 -159.6324 -157.2512
quadrupole: 4.5679 0.3067 0.3566
quadrupole: -2.5166 0.0677 2.4489 4.5679 0.3067 0.3566
hfenergy: -4062.6845104 hartree
pointgroup: C01 [X(C10H4Cl8)]
dipole: 0.2599449 0.6858977 -0.7982027 debye
dipolederiv: -0.2005036 0.0563028 0.0838759 0.0375272 -0.1617435 -0.1720434 0.0906033 -0.186281 -0.4159629 -0.2386883 -0.0941908 0.0487986 -0.1085986 -0.2264229 0.2228474 0.1277916 0.2635922 -0.4624978 -0.1912278 0.0737348 -0.0545053 0.0833515 -0.5851713 0.1786843 -0.0709891 0.1868133 -0.1912575 -0.1569556 0.0891935 0.0276936 0.0984278 -0.508567 -0.1943542 0.0134794 -0.1952877 -0.1939799 -0.4921741 0.2710282 0.146517 0.2181615 -0.1589214 -0.0660818 0.2406655 -0.1396572 -0.0186535 -0.2590904 -0.3118305 0.103149 -0.2496374 -0.3833116 0.1095095 0.1491938 0.2094555 -0.0129741 -0.2430262 0.3039645 0.0162355 0.2405053 -0.4215108 0.000308 0.0341702 -0.0025282 0.032954 -0.7945608 -0.2204246 0.1793352 -0.1405219 -0.1155468 0.0374661 0.1965875 0.0565809 -0.0213945 0.1742953 -0.1296341 -0.1223374 -0.0138521 0.0089058 0.2508538 -0.1238201 0.3285411 0.5227218 0.3820157 0.380976 -0.1019157 0.2104046 -0.001295 -0.3070002 -0.0645472 -0.3904623 0.5892224 0.1969148 -0.0772793 0.2190398 0.0086132 0.7843089 -0.3782537 0.1751106 -0.3423413 0.2254023 0.2542691 -0.1951468 0.0482771 -0.2299507 0.6532576 0.4439645 0.0873824 0.3650154 0.2357348 -0.0155208 0.0407824 -0.1105337 0.040708 -0.2315501 -0.0128389 -0.0667846 0.0008699 -0.1129414 -0.2056454 -0.0621388 0.0656398 -0.0529499 -0.1329651 -0.0166376 0.0417812 -0.0195989 0.0233935 0.5300036 -0.363892 -0.2362157 -0.4599829 0.0543317 0.2349 -0.3218718 0.3291228 -0.0574852 0.1415051 0.413955 -0.1098694 0.4917648 0.4411038 -0.2980566 -0.15891 -0.4175733 -0.0620045 -0.0659233 -0.6076925 0.055306 -0.473979 0.5517714 0.0619955 -0.1036798 0.0423905 -0.2050912 1.0393384 0.4031799 -0.2583129 0.3352318 0.2191878 -0.0939256 -0.2766189 -0.0741795 -0.0590048 -0.0451421 -0.0360388 0.0805403 -0.0388125 0.0702651 0.0183821 0.0895584 0.0100672 0.1121659 0.0269475 -0.0020879 -0.0642881 0.0023423 0.0575211 -0.0157788 -0.0552525 -0.0129732 0.0182034 0.0528424 0.0143988 -0.0285367 -0.0164682 0.0316976 -0.0436709 -0.0234916 -0.0717752 0.058408 0.1103265 0.0528404 0.012107 0.0177151 0.0546547 0.0397305 0.0196418 0.0602091 -0.0049586 unknown
polarizability: 192.3309969|-3.8487556|201.1636915|-21.7133704|-5.9840609|130.1221262 unknown
InChI: InChI=1S/C10H4Cl8/c11-3-1-9(17)7(15)2-8(16,6(14)5(7)13)10(9,18)4(3)12/h1-2H2
charge 0 multiplicity 1
22 atoms
Cl -0.401725 1.683374 2.088986
Cl 0.246913 -1.456225 2.071792
Cl -1.257356 2.810705 -1.283911
Cl -0.099805 -2.762432 -1.353459
Cl -3.636158 1.186236 0.535108
Cl -2.899273 -2.276913 0.510653
Cl 2.960868 -2.10226 0.087604
Cl 4.2200 1.030447 -0.493014
C  0.197499 1.027679 0.448161
C  0.539261 -0.564294 0.447715
C  -0.946788 1.106885 -0.63044
C  -0.47612 -1.099816 -0.65115
C  -0.446064 0.069801 -1.679027
C  1.516134 1.762626 0.06254
C  -2.188692 0.382812 -0.092601
C  -1.902853 -0.947685 -0.098973
C  2.012048 -0.591521 0.118473
C  2.521198 0.650743 -0.08398
H  0.557463 0.276469 -2.082278
H  -1.168582 -0.076367 -2.493808
H  1.818465 2.477858 0.845401
H  1.388667 2.339078 -0.87299
