program: Gaussian 09
title: 000227056
version: EM64L-G09RevD.01
frameworkgroup: C1[X(C23H30O4)]
method: RPBEPBE
basis: SDD
operation: Freq
keyword: #pfreq=noraman
keyword: PBEPBE/SDD
title: #p freq=noraman PBEPBE/SDD
converged: YES YES NO NO
title: Mulliken charges:
elementType: O O O O C C C C C C C C C C C C C C C C C C C C C C C H H H H H H H H H H H H H H H H H H H H H H H H H H H H H H
charge: -0.192486 -0.243375 -0.251523 -0.241628 0.383413 -0.107142 -0.127775 -0.112329 -0.250479 -0.534888 -0.555774 -0.520912 0.127412 -0.474958 -0.482181 -0.822738 -0.649907 0.567318 0.158346 -0.781986 -0.172411 -0.642821 -0.436792 -0.413595 0.180708 0.310610 -0.754099 0.215029 0.223016 0.229298 0.234669 0.205590 0.209472 0.213700 0.237841 0.225632 0.217726 0.264452 0.217688 0.231036 0.220270 0.230582 0.222531 0.251925 0.221697 0.238007 0.226726 0.248263 0.225671 0.235808 0.263093 0.262539 0.263835 0.253520 0.261774 0.246670 0.243931
chargesum: 0.00000
title: Mulliken charges with hydrogens summed into heavy atoms:
elementType: O O O O C C C C C C C C C C C C C C C C C C C C C C C
charge: -0.192486 -0.243375 -0.251523 -0.241628 0.383413 0.107887 0.095241 0.116969 -0.015810 -0.119826 -0.104233 -0.077554 0.127412 0.007183 -0.030875 -0.117699 -0.190203 0.567318 0.158346 -0.081327 0.063397 -0.379728 0.089582 -0.160075 0.180708 0.310610 -0.001724
polarizability: 3.44703933e+02 -1.43066884e+01 2.27643445e+02 -2.98030520e+01 1.13001354e+00 1.97744324e+02
1716.lowfreq: -8.0997 -0.0010 -0.0006 -0.0002 2.3776 10.5467 20.7018 23.2622 33.1445
frequency: 20.2690 22.9004 33.0266 38.7607 57.2831 66.8071 71.4547 76.6951 91.7809 119.3231 149.3782 154.3073 180.6501 190.8621 205.8060 223.3865 224.3477 236.1538 251.6842 264.0940 271.7111 279.8789 286.5932 299.6033 308.0068 318.4618 345.3622 359.6329 371.5040 404.4663 422.3384 435.5036 445.2144 448.8418 478.6999 488.4161 500.5407 529.0609 546.5186 550.8947 555.5564 595.4276 621.5773 638.7253 661.5215 676.7371 681.9838 694.5535 736.3828 749.7841 783.8105 804.2342 821.0355 821.9676 829.3851 843.0796 873.7112 896.7532 902.8419 908.4019 921.9092 925.1297 936.2093 939.4849 953.3080 964.4878 984.0534 994.7974 998.6704 1001.5035 1010.5669 1021.0516 1029.9076 1033.0307 1041.0537 1045.2749 1064.6368 1073.0604 1086.2357 1099.1825 1107.0080 1111.1507 1115.4794 1124.6989 1136.3522 1155.4011 1161.6220 1178.6846 1185.2419 1195.9482 1205.5099 1215.6233 1222.6108 1231.0825 1241.5575 1247.1029 1251.0980 1267.5394 1275.3245 1286.9233 1289.5951 1293.5750 1302.1254 1316.8270 1322.2075 1327.2821 1330.2986 1337.8192 1342.4039 1349.0722 1349.9032 1354.1456 1370.7605 1382.0884 1383.6704 1391.7739 1401.4293 1411.8218 1453.3708 1454.0402 1457.4378 1460.6573 1464.9825 1467.4855 1473.5310 1478.2701 1479.3554 1483.6003 1491.8339 1493.3108 1557.0204 1609.6970 1635.0192 1659.2193 1667.8468 2909.6443 2941.5149 2953.7800 2964.0907 2966.4276 2969.7712 2977.0717 2987.6004 2991.4807 2993.0616 2995.0821 2996.5682 3008.8360 3017.3544 3018.4553 3040.0446 3048.7128 3051.5336 3054.8894 3078.5127 3080.0315 3082.8802 3087.9120 3094.7411 3096.8612 3101.5122 3103.0183 3127.8524 3142.8138 3148.8094
redmass: 4.8111 6.4808 4.4061 5.5406 3.4134 4.9642 1.1846 3.6845 3.8763 4.0378 2.0614 5.0831 4.3234 2.3882 2.4660 1.8711 1.8507 1.5623 3.5088 2.7040 2.0484 2.5358 2.6235 3.2583 3.2879 5.6078 4.3416 2.3689 3.1569 3.1754 3.6023 3.8963 2.9427 2.7035 4.1478 2.5793 3.8644 2.6376 2.9159 3.2731 3.2473 3.2959 4.5718 3.2644 3.6693 3.3242 3.2244 3.0372 3.6945 2.9731 4.6032 2.2265 1.5632 2.1483 1.6954 2.1214 2.7068 2.1808 2.9041 1.6501 2.0335 2.4033 1.8076 2.2994 2.0133 2.1701 2.4139 1.6270 2.1010 1.9582 2.6016 2.7211 2.0194 1.8709 1.8472 3.0105 2.5310 3.0840 1.9018 2.4476 1.9963 1.9414 1.7734 2.3264 1.6683 1.6840 2.3551 1.4639 1.9739 2.8664 1.5922 1.2123 1.2785 1.4303 1.5001 1.3377 1.3765 1.4676 1.3316 1.4078 2.1813 1.3456 1.3268 1.4085 1.3722 1.3180 1.3365 1.3980 1.4681 1.4425 1.5576 2.0647 1.4529 1.6196 1.2388 1.4846 1.1974 1.1007 1.0556 1.0543 1.0796 1.0857 1.0913 1.0774 1.0754 1.0741 1.0617 1.0598 1.0799 1.0631 8.5854 8.5100 8.5290 7.3082 9.4487 1.0815 1.0814 1.0615 1.0807 1.0708 1.0658 1.0726 1.0626 1.0453 1.0409 1.0586 1.0542 1.0376 1.0882 1.0690 1.0980 1.0989 1.1015 1.1005 1.0980 1.0978 1.1037 1.0996 1.0995 1.0984 1.0952 1.0863 1.0918 1.1021 1.0974
irintensity: 0.2500 2.5113 2.2607 1.0937 0.9776 0.1813 0.9749 3.7524 2.5132 3.1599 0.0659 1.0343 2.3413 0.6961 0.0403 1.6915 1.5106 0.6153 1.5700 1.6479 1.6038 13.8300 3.1171 1.2268 1.4613 9.3494 4.8547 0.1604 0.2414 2.0737 3.4214 7.2345 3.6350 7.0587 5.6321 1.6898 5.6382 0.2768 1.3667 2.7793 1.6920 0.9870 3.6167 0.6327 0.8562 9.6974 6.1027 9.4888 5.8689 3.7935 31.2686 4.6480 11.9612 3.7676 7.5060 5.1761 0.9158 4.9591 44.7275 22.1417 7.0128 25.0477 2.1654 2.8382 4.1667 13.8751 1.5201 1.4732 6.8915 5.8512 120.6372 7.8143 2.6323 6.1054 12.7000 42.6159 1.8348 1.4164 13.2719 45.9642 27.3300 1.6994 5.6483 7.0925 8.0734 6.2231 8.1539 0.8437 61.0984 279.9196 13.4506 13.6174 2.0063 5.2482 13.8404 26.5532 0.9492 1.8790 3.1027 6.4321 19.8091 1.9564 0.8298 1.8727 22.0881 0.9092 1.3310 2.1582 21.5717 6.3302 22.2061 1.8683 18.2710 12.6207 61.1952 9.3845 34.5070 31.4100 21.2447 19.2526 2.3947 19.7995 7.6327 9.3637 13.3689 3.1830 6.8336 6.9556 9.5603 6.4006 186.2431 15.5627 84.4624 167.9580 174.3984 10.9897 5.5906 32.6554 22.2835 27.5761 8.3652 45.7298 29.9513 18.2583 8.2539 19.2348 41.9143 1.4751 63.2102 17.0051 39.8733 26.2047 48.9772 23.5495 31.2052 2.1051 35.7632 17.8943 28.5218 18.9367 8.3804 16.5930 10.5709 9.9586 14.6362
temp: 298.150 k
press: 1.00000 atm
elementType: 8 8 8 8 6 6 6 6 6 6 6 6 6 6 6 6 6 6 6 6 6 6 6 6 6 6 6 1 1 1 1 1 1 1 1 1 1 1 1 1 1 1 1 1 1 1 1 1 1 1 1 1 1 1 1 1 1
symmnumber: 1
zpe: 1261949.9 jmol-1
zpe.correction: 0.480651 hartree
zpe.thermalcorrener: 0.506768 hartree
zpe.thermalcorrenthalpy: 0.507712 hartree
zpe.thermalcorrgfe: 0.423601 hartree
zpe.sumelectzpe: -1193.287615 hartree
zpe.sumelectthermal: -1193.261499 hartree
zpe.sumelectthermalent: -1193.260554 hartree
zpe.sumelectthermalfe: -1193.344665 hartree
dipole: -2.2138 0.0863 2.5197
dipole: 3.3552
quadrupole: -226.6889 -155.0379 -164.6547
quadrupole: 25.1201 12.1916 -4.6509
quadrupole: -44.5617 27.0893 17.4725 25.1201 12.1916 -4.6509
hfenergy: -1193.7682664 hartree
pointgroup: C01 [X(C23H30O4)]
dipole: 0.8825277 0.1186187 -0.9744358 debye
polarizability: 345.0874772|17.6779731|227.971853|-26.717547|1.1298892|197.0323723 unknown
InChI: InChI=1S/C23H30O4/c1-14(24)27-13-21(26)20-7-6-18-17-5-4-15-12-16(25)8-10-22(15,2)19(17)9-11-23(18,20)3/h8,10,12,17-20H,4-7,9,11,13H2,1-3H3
charge 0 multiplicity 1
57 atoms
O  4.405646 1.066784 -0.61144
O  5.384088 -1.440892 -0.01219
O  -6.809967 -1.538064 1.373989
O  6.793451 -0.224879 1.397397
C  1.141711 0.425888 -0.163824
C  0.051558 1.358355 0.46084
C  -1.326564 1.233861 -0.224718
C  -1.802698 -0.254188 -0.111911
C  2.373191 0.849272 0.742365
C  0.665032 -1.036777 -0.003189
C  0.740182 2.742174 0.536885
C  -0.73295 -1.247454 -0.647933
C  -3.251468 -0.473696 -0.749903
C  2.232985 2.4041 0.868833
C  -2.360981 2.196336 0.402595
C  1.44019 0.747075 -1.652409
C  -3.772653 2.002589 -0.213506
C  -4.195196 0.551526 -0.114407
C  3.728226 0.399406 0.209868
C  -3.232135 -0.267788 -2.305801
C  -3.712477 -1.900632 -0.510589
C  -5.329653 0.184906 0.560035
C  4.236012 -0.946149 0.753113
C  -4.848214 -2.245894 0.158997
C  -5.745162 -1.220693 0.745394
C  6.639303 -0.921963 0.372839
C  7.699544 -1.337642 -0.616419
H  -0.08575 1.00752 1.510833
H  -1.215729 1.504533 -1.2959
H  -1.926343 -0.46029 0.975251
H  2.212991 0.37152 1.732285
H  0.606038 -1.286598 1.077418
H  1.379478 -1.746317 -0.466614
H  0.286495 3.393627 1.303917
H  0.659602 3.272526 -0.430717
H  -0.643724 -1.154951 -1.746855
H  -1.051496 -2.285721 -0.442752
H  2.930009 2.895087 0.168374
H  2.508161 2.730861 1.886995
H  -2.038389 3.2448 0.260326
H  -2.414205 2.016048 1.49607
H  2.162944 0.021642 -2.068079
H  0.529852 0.698816 -2.273219
H  1.885174 1.748116 -1.778485
H  -3.741656 2.325118 -1.274524
H  -4.507783 2.648931 0.29869
H  -2.630695 -1.051607 -2.798756
H  -4.258921 -0.329223 -2.70629
H  -2.810563 0.712532 -2.585423
H  -3.092019 -2.688545 -0.958557
H  -5.984166 0.941577 1.010747
H  3.45824 -1.724098 0.675136
H  4.514577 -0.808481 1.817885
H  -5.151518 -3.291883 0.285075
H  7.653947 -0.661802 -1.489669
H  7.521937 -2.363294 -0.976796
H  8.695007 -1.255607 -0.156079
