program: Gaussian 09
title: 000227053
version: EM64L-G09RevD.01
frameworkgroup: C1[X(C10H15ClN4)]
method: RPBEPBE
basis: SDD
operation: Freq
keyword: #p
keyword: freq=noraman
keyword: PBEPBE/SDD
title: #p freq=noraman PBEPBE/SDD
converged: YES YES NO NO
title: Mulliken charges:
elementType: Cl N N N N C C C C C C C C C C H H H H H H H H H H H H H H H
charge: -0.058845 -0.415869 -0.060391 -0.653736 0.045938 -0.048738 -0.441078 -0.422073 -0.413787 -0.407484 -0.379037 0.185253 0.261796 -0.278273 -0.379822 0.252038 0.213231 0.201326 0.194936 0.246353 0.176160 0.212489 0.208328 0.196870 0.195433 0.204150 0.301198 0.300787 0.316635 0.246210
chargesum: 0.00000
title: Mulliken charges with hydrogens summed into heavy atoms:
elementType: Cl N N N N C C C C C C C C C C
charge: -0.058845 -0.114671 -0.060391 -0.036313 0.045938 0.203300 -0.026520 0.019215 -0.025138 -0.002286 0.020546 0.185253 0.261796 -0.278273 -0.133612
polarizability: 1.98925796e+02 5.58630497e-01 1.49113988e+02 1.02352963e+01 -7.48706285e-01 9.34295798e+01
1716.lowfreq: -38.5317 -15.7814 -7.0027 -0.0024 -0.0021 -0.0018 24.2931 33.0847 71.6009
frequency: 12.1702 30.2293 71.5119 95.7960 158.0298 191.0804 208.5247 217.8584 241.1396 287.1620 300.1715 329.5915 355.7697 369.5098 397.7933 448.8118 476.5655 497.8330 536.0982 548.3161 577.4057 588.7285 610.4584 637.5916 683.9239 756.1094 767.8066 784.4304 802.5797 821.0923 857.1456 867.8248 886.4043 898.1815 921.0428 999.3142 1005.9896 1044.2968 1049.0164 1078.7120 1084.3955 1112.6085 1127.9899 1148.6326 1167.0478 1197.9130 1242.2328 1256.6170 1270.1052 1293.5745 1306.7953 1320.4136 1326.1869 1328.5369 1331.8603 1347.7710 1352.2383 1360.5735 1393.5709 1433.4363 1451.7968 1455.1412 1459.5629 1464.9204 1472.5677 1481.4703 1539.4073 1562.3962 1632.1054 2948.7226 2965.0478 2968.3809 2979.3540 2984.3568 3027.7829 3031.2477 3037.7707 3044.8690 3046.8591 3060.0688 3176.7415 3492.3505 3523.7681 3626.3918
redmass: 3.9660 4.9494 4.1050 4.8808 4.1973 2.8496 4.3454 4.5068 4.9219 2.4925 2.1651 1.3841 6.4047 2.3315 2.4506 2.9533 2.1771 3.7117 2.3658 1.8449 3.1817 2.6038 2.1128 2.4656 6.5658 9.6950 1.5588 6.9250 3.4933 1.8071 2.4053 2.4703 2.4357 1.4242 1.4156 2.3205 2.7630 1.4426 1.7787 2.1162 1.7432 1.0996 2.3886 1.8363 2.9532 2.7027 1.3583 1.2747 1.3113 1.8025 2.7646 1.8312 2.4959 1.3826 1.4400 1.4586 1.4505 1.4013 1.7759 1.8801 1.2107 2.7701 1.1068 1.1183 1.0964 1.1404 4.3213 4.9992 1.2455 1.0679 1.0670 1.0604 1.0642 1.0623 1.0929 1.0948 1.1009 1.0959 1.0928 1.0981 1.0924 1.0451 1.0756 1.1012
irintensity: 2.1943 0.0849 0.7989 0.9926 0.5108 0.2755 1.9519 0.6464 1.2414 2.8208 10.5143 43.2970 8.1105 6.7246 5.8322 0.8187 0.3060 1.3235 50.2725 86.1808 20.7338 94.8761 148.8895 4.1333 33.3492 3.5097 0.7772 19.1295 2.2821 8.9522 13.4827 12.7133 1.9111 14.7838 13.0277 22.2228 6.5677 0.7843 0.4032 144.8837 0.2882 1.3176 1.7956 15.5545 13.2740 10.8978 13.1547 4.4563 26.5247 3.8589 17.8219 16.3091 40.6221 0.5611 1.8729 3.2900 1.7604 8.7931 55.4086 2.3192 25.4687 70.7053 3.3010 9.1755 26.6784 45.5797 677.8885 51.2000 119.2235 33.9207 23.6416 41.3856 18.3827 37.1930 74.1436 75.4562 29.1142 26.1331 66.4488 41.8057 14.1109 26.5825 31.2061 31.2702
temp: 298.150 k
press: 1.00000 atm
elementType: 17 7 7 7 7 6 6 6 6 6 6 6 6 6 6 1 1 1 1 1 1 1 1 1 1 1 1 1 1 1
symmnumber: 1
zpe: 647464.4 jmol-1
zpe.correction: 0.246606 hartree
zpe.thermalcorrener: 0.260851 hartree
zpe.thermalcorrenthalpy: 0.261795 hartree
zpe.thermalcorrgfe: 0.203621 hartree
zpe.sumelectzpe: -1068.002592 hartree
zpe.sumelectthermal: -1067.988347 hartree
zpe.sumelectthermalent: -1067.987403 hartree
zpe.sumelectthermalfe: -1068.045577 hartree
dipole: -4.9793 -3.3347 -1.0108
dipole: 6.0775
quadrupole: -107.5505 -91.1901 -97.6523
quadrupole: -4.9653 -1.2883 2.3472
quadrupole: -8.7529 7.6075 1.1453 -4.9653 -1.2883 2.3472
hfenergy: -1068.2491983 hartree
pointgroup: C01 [X(C10H15Cl1N4)]
dipole: -2.0490449 -1.1619248 -0.4105583 debye
polarizability: 198.1817294|-3.0575697|149.2073956|12.59222|-3.243945|94.0802385 unknown
InChI: InChI=1S/C10H15ClN4/c11-9-8(12)10(14-6-13-9)15-7-4-2-1-3-5-7/h6-7,15H,1-5,12H2
charge 0 multiplicity 1
30 atoms
Cl 4.415798 -1.433753 0.590497
N  -0.584752 -0.312064 -0.437726
N  0.978781 1.473598 -0.326108
N  1.477699 -2.210459 -0.02804
N  3.307972 1.038897 0.180222
C  -1.720852 0.608288 -0.690541
C  -2.871501 -0.169188 -1.375704
C  -2.218225 1.297548 0.612016
C  -3.580825 -1.158629 -0.415746
C  -2.920497 0.30756 1.571208
C  -4.076392 -0.44092 0.863673
C  0.711774 0.132685 -0.260834
C  1.763197 -0.83947 -0.037044
C  3.029131 -0.274807 0.206427
C  2.266571 1.863597 -0.118787
H  -1.333371 1.388138 -1.369268
H  -2.485492 -0.695023 -2.269916
H  -3.614982 0.571445 -1.730568
H  -2.932705 2.095185 0.32259
H  -1.362595 1.794546 1.10298
H  -2.89325 -1.983911 -0.128378
H  -4.427802 -1.641034 -0.940028
H  -3.30282 0.852319 2.455307
H  -2.183837 -0.428576 1.955745
H  -4.863322 0.28973 0.583881
H  -4.544828 -1.168647 1.553967
H  -0.804634 -1.242916 -0.075267
H  0.806677 -2.566455 -0.710431
H  2.249067 -2.835227 0.212285
H  2.481913 2.932946 -0.182612
