program: Gaussian 09
title: 000227051
version: EM64L-G09RevD.01
frameworkgroup: C1[X(C12H14O2S)]
method: RPBEPBE
basis: SDD
operation: Freq
keyword: #p
keyword: freq=noraman
keyword: PBEPBE/SDD
title: #p freq=noraman PBEPBE/SDD
converged: YES YES NO NO
title: Mulliken charges:
elementType: S O O C C C C C C C C C C C C H H H H H H H H H H H H H H
charge: 0.116149 -0.426436 -0.182039 -0.491622 -0.044898 -0.409856 -0.449234 -0.410687 -0.225648 0.399674 -0.346880 -0.313071 -0.219875 -0.230253 -0.220757 0.320704 0.202609 0.233252 0.238554 0.225910 0.229297 0.217319 0.216597 0.339431 0.274785 0.250632 0.236226 0.234339 0.235778
chargesum: 0.00000
title: Mulliken charges with hydrogens summed into heavy atoms:
elementType: S O O C C C C C C C C C C C C
charge: 0.116149 -0.087005 -0.182039 -0.170919 0.157711 0.061950 0.005973 0.023229 -0.225648 0.399674 -0.072095 -0.062439 0.016352 0.004085 0.015022
polarizability: 2.42737849e+02 2.52601424e+00 1.29873751e+02 -6.04457825e+00 1.74557547e+01 1.00015352e+02
1716.lowfreq: -15.9600 -8.3673 -0.0014 0.0013 0.0017 3.3220 8.5138 26.4007 39.0497
frequency: -5.6379 24.5263 39.0372 46.6712 83.7910 129.1279 155.7793 159.8585 190.5177 257.5635 337.6642 357.2303 380.7971 397.2471 406.7294 427.5301 434.5392 511.2223 526.8130 601.0358 612.9629 630.7600 667.3862 692.0179 724.3665 774.4630 784.7066 856.6563 860.6539 877.9646 900.1976 933.6827 946.8746 968.9053 989.2578 990.4443 1007.9645 1012.1787 1026.1481 1037.7644 1060.0983 1088.4124 1095.1999 1158.8384 1165.6494 1175.3713 1186.5580 1207.3988 1214.6309 1236.8911 1250.4713 1261.0572 1289.1225 1297.6390 1307.1864 1320.1574 1331.5351 1377.2772 1388.4938 1435.8624 1470.3514 1475.4803 1477.1257 1489.3405 1578.0069 1605.7103 1610.7764 2938.5101 3008.7419 3015.8165 3025.3251 3033.4536 3063.0321 3083.9313 3095.6984 3132.1409 3141.0406 3151.2842 3162.2407 3172.4484 3532.0340
redmass: 4.4081 5.3983 3.7907 3.0498 3.1938 3.2432 5.1243 4.8477 5.6348 4.9837 4.8225 1.7677 1.8061 2.8098 7.2188 3.8065 4.8818 5.3733 6.6089 3.0736 6.4637 4.9875 7.5134 1.7715 3.3774 1.2430 1.8782 1.2644 2.8719 4.5875 2.7151 1.7689 1.4178 1.7158 5.9904 1.4001 1.3362 2.1990 2.1779 3.9675 2.3570 1.5796 3.2537 1.4447 1.3317 1.0650 1.2863 2.3966 1.2287 1.2392 1.2120 1.2231 1.2973 1.2566 1.2821 1.3148 1.4230 1.5233 8.9893 2.2589 1.0769 1.0853 2.1763 1.0943 6.9006 7.0781 7.6041 1.0845 1.0596 1.0625 1.0646 1.0847 1.1022 1.1033 1.1043 1.0853 1.0884 1.0927 1.0963 1.1013 1.0656
irintensity: 0.2652 0.1891 0.8236 0.8326 0.5468 3.0702 0.4749 1.2001 7.0530 6.6114 27.7412 57.1365 104.2490 0.0485 0.8055 1.5981 12.9400 7.4369 8.8313 0.1606 1.5293 16.1564 87.9918 55.7360 20.7260 6.2596 47.1492 2.3218 101.3434 116.6302 8.1506 1.0367 3.4501 5.5769 1.4541 0.4786 0.1229 22.7681 2.1631 53.9203 27.2938 9.8453 6.0925 5.2948 0.8887 4.8495 107.6846 142.1031 15.7976 10.8647 6.4566 6.9557 3.9279 4.6872 14.3640 3.2920 26.5095 2.0003 3.7350 16.0943 0.4552 15.3250 3.6228 7.8560 59.0631 54.1578 55.2685 43.2833 20.7186 38.1705 40.5559 15.5576 7.6167 14.3096 56.5564 0.2258 6.5535 15.0967 13.8289 23.3310 3.4643
temp: 298.150 k
press: 1.00000 atm
elementType: 16 8 8 6 6 6 6 6 6 6 6 6 6 6 6 1 1 1 1 1 1 1 1 1 1 1 1 1 1
symmnumber: 1
zpe: 609338.1 jmol-1
zpe.correction: 0.232085 hartree
zpe.thermalcorrener: 0.245811 hartree
zpe.thermalcorrenthalpy: 0.246756 hartree
zpe.thermalcorrgfe: 0.189563 hartree
zpe.sumelectzpe: -1013.073462 hartree
zpe.sumelectthermal: -1013.059735 hartree
zpe.sumelectthermalent: -1013.058791 hartree
zpe.sumelectthermalfe: -1013.115983 hartree
dipole: -2.3605 -1.0019 -2.0243
dipole: 3.2671
quadrupole: -78.2491 -94.6704 -101.6803
quadrupole: 3.3387 -7.9450 2.5279
quadrupole: 13.2842 -3.1371 -10.1471 3.3387 -7.9450 2.5279
hfenergy: -1013.3055462 hartree
pointgroup: C01 [X(C12H14O2S1)]
dipole: 0.9692669 -0.8426117 -0.0519826 debye
polarizability: 240.5245886|11.6025051|121.2983789|-15.3964533|21.2241845|110.8039845 unknown
InChI: InChI=1S/C12H14O2S/c13-10-7-4-8-11(10)15-12(14)9-5-2-1-3-6-9/h1-3,5-6,10-11,13H,4,7-8H2
charge 0 multiplicity 1
29 atoms
S  -0.539458 -0.916604 -0.433911
O  -3.160713 0.889758 -1.663434
O  0.266624 1.191797 1.132357
C  -2.153487 -0.283606 0.329466
C  -3.283424 -0.221976 -0.724873
C  -2.719596 -1.161031 1.471941
C  -4.532761 -0.037958 0.155006
C  -4.276846 -0.950698 1.395105
C  0.666097 0.289075 0.35873
C  2.099302 0.085415 -0.006499
C  3.045938 1.010474 0.515108
C  2.544063 -0.977201 -0.836943
C  4.413977 0.874367 0.207416
C  3.914448 -1.109885 -1.142047
C  4.851819 -0.185858 -0.622035
H  -1.916513 0.737643 0.681167
H  -3.334593 -1.190775 -1.271307
H  -2.29572 -0.861335 2.44499
H  -2.459483 -2.222567 1.313737
H  -5.462718 -0.287602 -0.381946
H  -4.584783 1.027793 0.44441
H  -4.671315 -0.488476 2.316082
H  -4.785044 -1.92431 1.276851
H  -2.28887 0.806967 -2.130675
H  2.685954 1.822869 1.154716
H  1.825769 -1.699899 -1.239048
H  5.138161 1.590261 0.6107
H  4.252771 -1.931769 -1.781842
H  5.915799 -0.292167 -0.861022
