program: Gaussian 09
title: 000227048
version: EM64L-G09RevD.01
frameworkgroup: C1[X(C9H12N2O2S)]
method: RPBEPBE
basis: SDD
operation: Freq
keyword: #p
keyword: freq=noraman
keyword: PBEPBE/SDD
title: #p freq=noraman PBEPBE/SDD
converged: YES YES NO NO
title: Mulliken charges:
elementType: S O O N N C C C C C C C C C H H H H H H H H H H H H
charge: 0.135951 -0.430858 -0.222118 -0.622431 -0.682355 -0.109583 -0.677071 -0.370900 0.476858 -0.200594 0.236797 -0.390194 -0.277446 -0.199158 0.242122 0.256141 0.307195 0.288675 0.302859 0.279901 0.214546 0.226782 0.219591 0.300510 0.313703 0.381076
chargesum: 0.00000
title: Mulliken charges with hydrogens summed into heavy atoms:
elementType: S O O N N C C C C C C C C C
charge: 0.135951 -0.049782 -0.222118 -0.039670 -0.068142 0.132539 -0.113735 -0.370900 0.476858 0.088081 0.236797 -0.175647 -0.050664 0.020433
polarizability: 1.82814036e+02 -7.80293950e+00 1.43270200e+02 -6.77950982e+00 3.47613137e+00 8.14126440e+01
1716.lowfreq: -11.7407 -0.0008 -0.0005 0.0021 2.2775 11.4214 28.1455 46.6651 48.5233
frequency: 27.7843 46.4664 48.5041 60.9250 98.3180 150.1743 182.0517 239.1173 242.8256 256.8053 258.8680 290.9063 354.3334 360.2749 382.8856 446.9921 449.4255 477.3887 517.3460 543.0323 549.5254 550.2391 574.4371 630.0826 659.9737 684.3287 722.9206 732.5275 756.5126 769.8888 827.3687 845.2461 916.3085 950.4281 973.4579 996.9565 999.4254 1036.0802 1042.1298 1046.9922 1090.6647 1137.5218 1147.9018 1170.8877 1207.2402 1246.1945 1258.5040 1279.2348 1314.1751 1321.2114 1381.1581 1390.3528 1433.0999 1440.6072 1484.4572 1571.6345 1595.5928 1623.5812 1628.0237 1682.9665 2879.8069 3033.7077 3115.1137 3127.5620 3136.1771 3150.0583 3168.1280 3467.5604 3516.2194 3525.0560 3601.5030 3689.8531
redmass: 5.0521 7.0077 6.9875 5.3392 5.9376 4.2849 3.9401 4.5129 1.3122 3.9017 3.7974 2.4688 1.3302 3.5891 4.8622 3.7477 3.4717 3.4432 1.1979 3.6972 4.4873 3.6379 1.3042 1.4268 6.5020 3.8289 3.3731 3.1793 1.4720 2.7200 5.3161 1.4641 1.8425 1.3488 1.3087 3.0742 2.8459 2.4527 2.0349 2.2033 2.1954 1.3583 1.1837 1.0548 1.5022 1.1737 1.6647 1.6176 1.3441 1.8835 7.5757 1.9287 1.0957 2.5136 2.8741 6.3163 1.6567 2.5587 1.0954 9.1602 1.0806 1.0605 1.0864 1.1051 1.0905 1.0927 1.0998 1.0445 1.0640 1.0467 1.0989 1.1017
irintensity: 0.3768 0.9976 3.2857 1.2076 0.9666 0.7649 0.2173 0.7166 32.7739 23.9252 19.0185 23.1565 167.0245 11.8588 3.4176 15.6560 20.8559 30.9392 73.3086 5.2791 1.8278 14.5997 48.1160 287.2476 5.5848 47.2606 3.0031 15.2478 96.2989 2.1706 4.8808 2.0955 12.5543 4.8265 1.1996 20.2492 33.7931 55.8803 125.2525 184.4112 29.5174 11.3444 8.5143 5.4366 0.3591 7.8018 24.4537 9.8116 10.5509 17.4974 21.4725 8.7010 17.4303 9.1255 82.8600 3.8395 23.3022 275.7305 47.2060 218.3717 52.5230 23.9620 10.9433 4.9700 25.7968 8.5099 24.2571 3.6258 27.2066 49.8879 4.7288 42.1768
temp: 298.150 k
press: 1.00000 atm
elementType: 16 8 8 7 7 6 6 6 6 6 6 6 6 6 1 1 1 1 1 1 1 1 1 1 1 1
symmnumber: 1
zpe: 529437.3 jmol-1
zpe.correction: 0.201652 hartree
zpe.thermalcorrener: 0.216406 hartree
zpe.thermalcorrenthalpy: 0.217350 hartree
zpe.thermalcorrgfe: 0.158617 hartree
zpe.sumelectzpe: -1007.118356 hartree
zpe.sumelectthermal: -1007.103602 hartree
zpe.sumelectthermalent: -1007.102658 hartree
zpe.sumelectthermalfe: -1007.161392 hartree
dipole: 1.4755 -2.6788 0.6792
dipole: 3.1328
quadrupole: -68.9348 -77.8413 -95.8094
quadrupole: 4.7465 -3.1431 -3.8997
quadrupole: 11.9270 3.0205 -14.9475 4.7465 -3.1431 -3.8997
hfenergy: -1007.3200083 hartree
pointgroup: C01 [X(C9H12N2O2S1)]
dipole: 0.6107148 0.7532184 -0.7608051 debye
dipolederiv: -0.283413 -0.0293531 0.026507 0.1730922 -0.0796311 0.0439788 -0.0326614 0.093716 -0.0647756 -1.3260245 0.0356465 -0.2850932 0.0970929 -0.3026096 -0.0612997 -0.4349104 -0.0707833 -0.485812 -0.9415815 -0.0549403 -0.103357 -0.2816707 -0.5666035 0.160124 0.1010393 0.2159345 -0.4243962 -0.6785459 0.0106435 0.1550192 0.0498482 -0.6120456 -0.1994049 0.144016 -0.1785524 -0.5039596 -0.2132971 0.1116194 0.0830115 0.2007734 -1.2907646 0.2428639 0.0377989 0.2556558 -0.7507361 0.445141 -0.100559 -0.2179554 0.0900009 0.2704133 0.1489075 -0.0363284 0.2373062 0.2612341 0.135674 -0.1082259 -0.1040595 -0.2263857 0.0033029 0.0088218 -0.2262247 -0.0194376 0.1795574 0.3696206 0.4581849 -0.1034994 0.0455815 -0.2415038 -0.0241549 0.008674 0.0519048 -0.1905267 -0.1489839 -0.0534349 -0.0295088 -0.350337 1.1881733 -0.4271373 0.1171253 -0.4206571 0.2960586 0.0017734 -0.0435889 0.0563104 0.196308 0.1089672 -0.0434738 -0.0998089 -0.0901548 -0.0505551 1.7545951 0.1333222 0.3232067 0.2113594 0.6176709 -0.3050387 0.3716363 -0.3746891 0.6109242 0.065726 -0.3039386 0.1871456 0.2154299 -0.333338 0.0672948 -0.0106178 -0.0213819 -0.216669 -0.4039616 0.0024322 0.0031241 -0.0423666 -0.0919151 -0.0620158 -0.0120174 -0.0539804 -0.2109246 0.2137343 0.0357622 0.0618891 -0.1982663 0.155628 -0.1216159 0.1494836 -0.1020883 -0.0618634 0.0182624 -0.0142271 0.0152563 0.0185428 -0.1222207 -0.1398653 0.0272026 -0.0989978 -0.0878651 -0.0330216 0.0315262 0.0553956 0.0400485 0.0319011 0.0686395 0.0970319 0.0647332 -0.1311987 0.041037 -0.0110863 0.0242908 -0.0505492 -0.0162179 -0.0552809 0.0265535 -0.0225289 0.06511 0.0973829 0.0348692 -0.0530716 0.0331665 0.0994094 0.0129411 -0.0665159 0.0165921 0.1310123 0.0273494 0.036156 0.0006079 -0.0906471 0.3459356 0.0432082 -0.0297499 0.0035913 0.1797142 0.2429232 0.0592116 0.0344843 0.0703894 0.1648619 0.1896998 0.00625 0.1098485 0.153725 -0.0984795 0.0525459 -0.0722424 0.0791413 0.0310583 0.0737054 -0.0959861 0.062841 0.1233544 0.0627623 -0.0069229 -0.0188522 -0.0299171 -0.0895241 0.1080201 -0.0087921 0.1030183 0.1287506 -0.0882864 -0.1173384 -0.0023157 -0.1176921 0.0305577 0.0241665 -0.0088465 0.0189231 0.1422244 0.1072621 -0.0305112 -0.0445282 -0.0464626 0.2421731 0.0508296 -0.0433643 0.0505625 0.3409852 0.2818821 -0.0649224 -0.0302458 -0.061563 0.25365 0.0441054 0.0062936 0.0353859 0.2973602 0.3504694 -0.0628708 0.0384807 -0.0249175 0.2026716 0.1519807 0.0127189 0.1332383 0.2692715 unknown
polarizability: 183.8279972|6.4393276|130.4738205|-1.3117461|-24.7523887|93.1950621 unknown
InChI: InChI=1S/C9H12N2O2S/c10-6-3-1-2-4-8(6)14-5-7(11)9(12)13/h1-4,7,12H,5,10-11H2
charge 0 multiplicity 1
26 atoms
S  0.164449 1.423375 0.216162
O  4.192278 -0.592778 0.905883
O  2.033312 -1.44071 0.872471
N  3.548704 0.086584 -1.767046
N  -2.617611 2.23424 -0.814541
C  2.677154 0.458522 -0.630925
C  1.214485 0.525828 -1.10024
C  -1.369096 0.386945 0.22195
C  -2.584445 0.947602 -0.287536
C  -1.340192 -0.920603 0.752224
C  2.865593 -0.619272 0.444477
C  -3.763186 0.142542 -0.238135
C  -2.513272 -1.707925 0.783146
C  -3.72278 -1.162395 0.287803
H  2.952994 1.43224 -0.156352
H  1.142105 1.091099 -2.044549
H  0.792186 -0.480674 -1.234144
H  -0.390264 -1.315193 1.128132
H  4.527824 -0.064482 -1.506451
H  3.436045 0.685995 -2.589291
H  -4.705554 0.553747 -0.621074
H  -2.483202 -2.722931 1.191471
H  -4.642835 -1.758233 0.311772
H  -3.480327 2.628678 -1.175528
H  -1.757547 2.780559 -0.836356
H  4.324483 -1.314158 1.579076
