program: Gaussian 09
title: 000227047
version: EM64L-G09RevD.01
frameworkgroup: C1[X(C13H17NO)]
method: RPBEPBE
basis: SDD
operation: Freq
keyword: #p
keyword: freq=noraman
keyword: PBEPBE/SDD
title: #p freq=noraman PBEPBE/SDD
converged: YES YES NO NO
title: Mulliken charges:
elementType: O N C C C C C C C C C C C C C H H H H H H H H H H H H H H H H H
charge: -0.287068 -0.479937 0.384818 0.330488 0.502139 -0.677281 -0.413031 -0.372334 -0.815212 -0.814996 0.223354 0.456629 -0.491130 -0.781658 -0.803284 0.218903 0.228853 0.310128 0.226286 0.226922 0.226516 0.223190 0.223194 0.231450 0.298571 0.194543 0.228440 0.227512 0.227687 0.215916 0.215780 0.314612
chargesum: 0.00000
title: Mulliken charges with hydrogens summed into heavy atoms:
elementType: O N C C C C C C C C C C C C C
charge: -0.287068 -0.181366 0.384818 0.330488 0.502139 -0.458378 -0.184178 -0.062206 -0.135489 -0.137162 0.223354 0.456629 -0.296587 -0.098020 -0.056975
polarizability: 2.95968607e+02 -3.64864390e+00 1.49306953e+02 1.75736935e-01 7.58518532e-02 8.03470667e+01
1716.lowfreq: -3.7574 -0.0007 0.0002 0.0007 9.8984 10.3258 27.7984 44.2198 73.3444
frequency: 26.5912 43.0274 73.3228 79.1102 84.4311 119.2358 135.5500 163.5160 166.6460 208.4830 209.4178 228.2115 242.1905 295.1847 322.4187 350.3203 371.4567 402.4065 442.4381 445.9118 455.8890 514.6388 577.6688 578.0418 636.5500 696.9604 717.9152 723.3788 742.9461 788.3734 846.8557 850.9040 852.0287 872.2485 915.6695 946.8265 971.4889 980.4209 982.2008 996.8225 1011.4126 1030.0150 1052.5345 1080.3114 1087.1120 1126.0718 1147.5649 1185.0011 1224.9228 1236.2586 1270.1119 1304.4313 1356.8341 1374.1561 1389.9314 1394.1144 1396.3473 1397.7848 1409.7318 1444.2624 1454.1608 1462.4021 1465.6280 1468.3717 1476.3796 1480.4062 1487.9312 1504.0458 1507.6078 1586.3562 1602.4129 1627.4811 1664.6485 2961.8876 2965.3783 2966.7429 2970.2627 3032.4500 3035.2955 3040.4673 3044.0466 3074.3852 3080.1373 3082.7595 3084.7697 3094.4148 3124.3031 3124.4063 3199.2994 3526.8738
redmass: 3.1308 3.8061 4.8154 1.0807 3.5173 1.2420 1.7910 1.1978 1.2981 3.8064 2.2973 4.3496 2.8656 2.5845 5.0960 3.5911 4.5015 2.7590 3.3051 2.6936 2.2874 3.9838 4.5129 2.7424 1.3468 3.3514 5.8268 2.6177 4.0760 5.7096 4.1115 1.3861 1.4835 1.5522 3.8324 1.4841 2.4419 1.2383 1.3191 1.6002 1.6970 1.4411 1.6361 1.7127 1.7242 1.9287 1.8672 1.7560 1.9088 3.0152 2.0016 2.0683 3.9744 1.2599 1.3444 1.2438 1.6611 1.9547 1.5313 1.0908 1.0499 1.0468 1.1190 1.1160 1.0463 1.2040 1.0470 2.6257 2.1479 8.1330 3.3041 6.3322 5.8775 1.0381 1.0380 1.0382 1.0376 1.0957 1.0969 1.0958 1.0969 1.0909 1.0985 1.0976 1.0975 1.0908 1.0957 1.0927 1.0944 1.0760
irintensity: 0.4512 2.2774 2.5055 0.6755 0.9185 0.3406 0.9607 3.8417 0.2219 3.6572 2.6924 0.2793 2.6178 1.1596 8.5717 0.2899 3.3533 0.0860 1.2087 10.0928 1.1888 3.2330 9.5520 21.3523 45.7051 0.1732 7.4007 2.8972 1.7918 5.9786 1.8501 57.1738 3.3578 40.1925 1.0337 0.0219 14.2983 8.1981 7.4109 13.3226 0.9007 15.0722 0.0654 58.0580 7.4520 5.3090 105.6936 40.9809 12.4392 20.9547 6.3346 31.8331 110.4313 55.0825 39.8449 4.6687 38.8828 7.5369 6.1097 22.7700 7.4937 0.1645 25.9303 74.3425 29.9563 1.2163 28.7438 149.4938 310.9599 79.4693 29.1913 59.6136 119.0890 10.4137 88.4865 68.7746 30.9178 7.3028 36.0970 34.6978 11.4460 9.3832 33.2754 5.4794 40.0516 29.5237 8.6976 17.5665 5.9961 10.8812
temp: 298.150 k
press: 1.00000 atm
elementType: 8 7 6 6 6 6 6 6 6 6 6 6 6 6 6 1 1 1 1 1 1 1 1 1 1 1 1 1 1 1 1 1
symmnumber: 1
zpe: 700846.1 jmol-1
zpe.correction: 0.266938 hartree
zpe.thermalcorrener: 0.283263 hartree
zpe.thermalcorrenthalpy: 0.284207 hartree
zpe.thermalcorrgfe: 0.222371 hartree
zpe.sumelectzpe: -634.459429 hartree
zpe.sumelectthermal: -634.443105 hartree
zpe.sumelectthermalent: -634.442161 hartree
zpe.sumelectthermalfe: -634.503996 hartree
dipole: 0.2956 3.5686 -0.0154
dipole: 3.5808
quadrupole: -68.1196 -85.6244 -94.8250
quadrupole: 4.8835 -0.0145 0.0303
quadrupole: 14.7368 -2.7681 -11.9687 4.8835 -0.0145 0.0303
hfenergy: -634.7263676 hartree
pointgroup: C01 [X(C13H17N1O1)]
dipole: 0.120298 -1.3994786 0.1083693 debye
polarizability: 295.9144788|3.8540994|148.9565094|-2.9445165|-5.0515414|80.751639 unknown
InChI: InChI=1S/C13H17NO/c1-9(2)7-13(15)14-12-6-5-10(3)11(4)8-12/h5-8,14H,1-4H3
charge 0 multiplicity 1
32 atoms
O  1.772309 1.453803 -0.228305
N  0.620582 -0.584019 -0.055746
C  -3.113461 -0.831516 -0.004664
C  -3.508284 0.539856 -0.087092
C  -0.733807 -0.15086 -0.073312
C  -1.739698 -1.153363 0.000603
C  -2.496202 1.52649 -0.161118
C  -1.121197 1.211025 -0.156367
C  -4.153762 -1.934741 0.07714
C  -4.97476 0.932133 -0.095681
C  1.795829 0.183622 -0.126291
C  4.326085 -0.227894 -0.125794
C  3.025145 -0.656937 -0.064831
C  5.458106 -1.235789 -0.038751
C  4.755972 1.215894 -0.278023
H  -1.443267 -2.210054 0.064019
H  -2.790349 2.581205 -0.225169
H  -0.355419 1.985331 -0.214903
H  -3.682871 -2.931557 0.124592
H  -4.795294 -1.821616 0.972392
H  -4.829269 -1.921307 -0.799838
H  -5.515681 0.480944 -0.950423
H  -5.495603 0.595154 0.821852
H  -5.091809 2.026948 -0.165088
H  0.749971 -1.595719 0.017468
H  2.859115 -1.739804 0.045018
H  5.094898 -2.271799 0.07228
H  6.094785 -1.185161 -0.943986
H  6.117742 -1.004047 0.820529
H  5.404053 1.50845 0.572114
H  5.370088 1.331259 -1.193567
H  3.893452 1.894469 -0.328962
