program: Gaussian 09
title: 000227046
version: EM64L-G09RevD.01
frameworkgroup: C1[X(C10H16O7)]
method: RPBEPBE
basis: SDD
operation: Freq
keyword: #pfreq=noraman
keyword: PBEPBE/SDD
title: #p freq=noraman PBEPBE/SDD
converged: YES YES NO NO
title: Mulliken charges:
elementType: O O O O O O O C C C C C C C C C C H H H H H H H H H H H H H H H H
charge: -0.243829 -0.299898 -0.247612 -0.455375 -0.252940 -0.248322 -0.269129 -0.154585 -0.092974 -0.152348 -0.054651 0.364065 -0.346830 -0.678716 -0.686173 0.330878 -0.506952 0.250538 0.254525 0.267305 0.242504 0.253241 0.279005 0.221351 0.221731 0.245083 0.234286 0.219089 0.226361 0.356926 0.243283 0.236826 0.243337
chargesum: 0.00000
title: Mulliken charges with hydrogens summed into heavy atoms:
elementType: O O O O O O O C C C C C C C C C C
charge: -0.243829 -0.299898 -0.247612 -0.098450 -0.252940 -0.248322 -0.269129 0.095953 0.161551 0.114957 0.187853 0.364065 0.185416 0.009450 -0.006437 0.330878 0.216495
polarizability: 1.68562156e+02 4.34757611e+00 1.13327356e+02 -2.51196084e+00 2.66373942e+00 1.07538699e+02
1716.lowfreq: -0.0011 -0.0007 -0.0006 1.1008 4.5260 14.0751 18.9119 32.7754 46.2642
frequency: 18.8017 32.6343 46.2273 52.6810 73.4801 85.9459 101.3752 130.5095 160.6239 171.6454 182.7555 185.5709 204.5628 225.3817 240.7472 284.7187 294.5996 313.3875 320.4812 352.8843 412.4744 427.0266 489.5808 525.1164 560.6921 599.6768 634.6643 649.2382 697.9193 719.5093 723.3933 747.4582 799.2968 829.3027 844.3088 858.1789 889.9348 914.4466 922.5524 935.1306 942.3733 954.1366 983.0002 1001.3410 1027.2423 1046.0165 1057.0517 1079.2414 1118.1576 1136.8939 1139.2521 1153.3521 1180.6709 1195.9267 1198.4466 1215.4108 1220.8752 1239.8693 1256.2598 1268.0285 1283.6551 1287.5000 1321.9728 1333.2058 1377.9976 1380.6253 1385.9833 1393.3241 1429.0363 1448.2179 1453.2929 1453.4454 1463.1296 1464.4571 1467.9032 1475.3547 1633.7135 3000.5102 3004.4446 3004.9052 3007.1378 3034.0392 3043.8604 3052.3779 3100.4431 3106.7943 3108.4300 3110.7466 3111.9280 3116.2568 3127.5195 3151.7793 3595.1344
redmass: 4.9229 4.6669 4.4756 4.4369 4.1696 1.2674 3.7636 4.3213 2.8503 1.0563 2.7630 1.8954 3.8701 1.2747 2.5275 3.6562 3.2298 3.8381 4.1488 3.0852 3.4744 4.1549 4.7308 5.5537 4.1379 5.0212 5.3096 6.4463 11.5715 4.4518 6.3899 4.5347 4.5988 4.0774 4.8768 4.1281 3.5957 7.4088 1.4846 2.6199 2.4510 3.6485 1.3189 6.1981 3.7329 2.0295 8.2986 2.4972 1.2552 2.0008 1.9047 1.5203 1.1210 3.0306 2.1950 2.0746 1.6063 2.9180 1.3963 1.3474 1.2641 1.3828 1.1592 1.3415 1.4765 1.3136 1.7241 1.2222 1.1850 1.0497 1.0493 1.0489 1.0792 1.0532 1.0600 1.0518 9.4659 1.0354 1.0375 1.0300 1.0821 1.0873 1.0583 1.0880 1.1001 1.1050 1.0996 1.0994 1.0912 1.1002 1.1079 1.1044 1.0670
irintensity: 0.0803 0.7548 1.4181 2.1731 2.0989 0.9208 7.9519 6.9873 12.6586 2.1336 37.8261 78.9597 2.3834 1.8995 14.4098 30.1530 3.6677 15.8204 1.3266 2.1458 3.3603 13.1345 12.7439 9.4409 11.9983 7.1383 4.3138 11.3802 17.7615 26.3696 13.0733 27.8718 8.7035 67.0015 12.2350 40.5356 7.9489 199.8056 0.1283 46.3099 45.6112 138.4210 0.6062 152.2391 71.0440 26.4729 9.4697 22.3383 0.0515 31.3129 55.4185 60.4782 22.0618 599.0197 271.4410 53.6804 33.5598 39.5948 1.5689 6.3089 0.4648 7.8163 4.8455 11.3157 0.9546 44.3780 6.6981 23.2162 43.3545 1.7281 15.0931 3.1437 11.0135 19.4935 3.5931 15.0658 256.6503 11.2610 19.5759 36.6101 13.7112 36.7151 11.4751 17.5895 0.5476 26.4641 30.5305 5.7867 35.6412 29.5648 6.3592 15.4156 17.4845
temp: 298.150 k
press: 1.00000 atm
elementType: 8 8 8 8 8 8 8 6 6 6 6 6 6 6 6 6 6 1 1 1 1 1 1 1 1 1 1 1 1 1 1 1 1
symmnumber: 1
zpe: 680684.6 jmol-1
zpe.correction: 0.259259 hartree
zpe.thermalcorrener: 0.277659 hartree
zpe.thermalcorrenthalpy: 0.278603 hartree
zpe.thermalcorrgfe: 0.210725 hartree
zpe.sumelectzpe: -915.845979 hartree
zpe.sumelectthermal: -915.827580 hartree
zpe.sumelectthermalent: -915.826635 hartree
zpe.sumelectthermalfe: -915.894514 hartree
dipole: -0.2436 -0.0954 -3.4486
dipole: 3.4585
quadrupole: -84.9775 -93.5014 -104.9448
quadrupole: -3.4522 -3.0537 -7.9938
quadrupole: 9.4971 0.9732 -10.4702 -3.4522 -3.0537 -7.9938
hfenergy: -916.1052385 hartree
pointgroup: C01 [X(C10H16O7)]
dipole: -0.0772154 1.3305343 -0.2742451 debye
polarizability: 168.8930197|1.7946962|106.6779268|1.5969355|-1.6468826|113.8572639 unknown
InChI: InChI=1S/C10H16O7/c1-10(2)16-7-6(11)5(15-8(7)17-10)4-14-9(12)13-3/h5-8,11H,4H2,1-3H3
charge 0 multiplicity 1
33 atoms
O  -0.931102 -1.2121 0.81844
O  -2.556016 1.260629 -0.300356
O  -3.335895 -0.805534 0.568322
O  0.353155 1.279486 2.036676
O  2.311356 0.060562 -0.390868
O  4.336779 0.631424 -1.121174
O  4.161822 -1.156506 0.39564
C  -1.85594 1.022138 0.975936
C  -2.118761 -0.477424 1.284791
C  -0.332127 1.126495 0.747691
C  0.013132 -0.264281 0.167246
C  -3.508273 0.134914 -0.57294
C  1.41793 -0.774448 0.465387
C  -3.116989 -0.532945 -1.89386
C  -4.945152 0.654932 -0.533739
C  3.653062 -0.248334 -0.298576
C  5.80419 0.422046 -1.148528
H  -2.225578 1.709295 1.757186
H  -2.287571 -0.761846 2.332514
H  -0.07927 1.938042 0.042613
H  -0.161409 -0.249727 -0.925947
H  1.521802 -1.835563 0.182237
H  1.682521 -0.633452 1.524085
H  -3.837862 -1.331983 -2.137673
H  -3.120486 0.211524 -2.70864
H  -2.114358 -0.982897 -1.816738
H  -5.137146 1.167809 0.422901
H  -5.114601 1.364632 -1.361376
H  -5.653142 -0.185648 -0.634141
H  0.397859 2.237093 2.276903
H  6.228878 0.545732 -0.138137
H  6.180114 1.194513 -1.833346
H  6.04068 -0.588476 -1.522028
