program: Gaussian 09
title: 000227045
version: EM64L-G09RevD.01
frameworkgroup: C1[X(C11H15N5O4)]
method: RPBEPBE
basis: SDD
operation: Freq
keyword: #p
keyword: freq=noraman
keyword: PBEPBE/SDD
title: #p freq=noraman PBEPBE/SDD
converged: YES YES NO NO
title: Mulliken charges:
elementType: O O O O N N N N N C C C C C C C C C C C H H H H H H H H H H H H H H H
charge: -0.291036 -0.425218 -0.429389 -0.468776 -0.200679 -0.085905 -0.178193 -0.062463 -0.605854 -0.093383 -0.152399 -0.151023 -0.031253 -0.055021 -0.714612 0.220475 -0.203331 -0.099102 0.169633 -0.334575 0.237582 0.292557 0.189252 0.284319 0.213854 0.217013 0.208377 0.253471 0.329261 0.387857 0.290587 0.351132 0.252145 0.348201 0.336496
chargesum: 0.00000
title: Mulliken charges with hydrogens summed into heavy atoms:
elementType: O O O O N N N N N C C C C C C C C C C C
charge: -0.291036 -0.095956 -0.041532 -0.117644 -0.200679 -0.085905 -0.178193 -0.062463 0.078842 0.144199 0.140159 0.038228 0.253066 0.158834 -0.035751 0.220475 0.087255 -0.099102 0.169633 -0.082430
polarizability: 2.32304543e+02 -3.24265575e+00 1.62119173e+02 -2.99514452e-01 1.18488798e+01 1.06045237e+02
1716.lowfreq: -6.4278 -1.8837 -0.0004 0.0004 0.0006 5.8299 27.0012 43.5708 62.3934
frequency: 26.8946 43.5682 62.3831 82.3116 91.1642 117.9030 157.5583 181.8611 207.3388 213.0677 229.1158 239.1090 240.7955 251.5869 269.1278 286.8977 287.5728 304.4837 343.8646 346.0872 427.3622 463.2147 504.2931 520.0252 533.2007 544.2541 556.0243 559.3377 567.8601 603.5226 611.2750 642.2272 662.3110 681.8243 711.9306 791.5587 802.8614 809.8240 839.7450 858.5120 869.8261 893.2040 929.9375 940.6362 949.4589 962.4958 982.8666 1018.2265 1025.0392 1041.2856 1054.5892 1063.8119 1086.7441 1095.2016 1105.2639 1148.3833 1182.2029 1189.0792 1198.8669 1221.1016 1229.6576 1247.7506 1260.4674 1284.5990 1295.4841 1297.5328 1307.6735 1326.7217 1335.8765 1343.8152 1351.8875 1373.2418 1375.7420 1382.7984 1386.2879 1388.9403 1436.9274 1464.8352 1473.4564 1475.2771 1480.4111 1540.7578 1581.1000 1636.0045 2887.0234 2943.2977 2969.3604 2980.9865 3012.1938 3040.1565 3069.5194 3101.2494 3102.4711 3172.7783 3262.8958 3537.3007 3540.5717 3582.9849 3691.8468
redmass: 5.5153 5.7529 6.6752 3.5592 5.5995 6.0372 5.2372 5.6486 4.6487 4.2210 1.2033 1.1667 1.5668 3.6684 2.6699 4.8148 4.3589 5.1988 4.6649 4.8471 3.1764 4.4103 3.7486 8.5484 1.2746 4.3229 1.1967 2.6383 4.0062 5.0916 5.4965 4.4488 9.5845 5.5241 7.1007 6.9657 3.7749 4.5160 1.5482 1.3660 3.3767 3.4099 1.4280 2.3095 3.6474 2.5703 4.3319 4.7240 2.1611 4.5300 3.8118 3.1213 2.6433 2.7617 2.1590 4.1116 1.7218 1.2321 1.3035 1.5704 1.8954 1.4888 1.1748 2.8475 1.7092 2.8024 1.2657 2.9999 1.4611 1.4128 1.3230 1.8642 1.7605 5.8661 1.2428 1.2651 3.2000 1.0449 3.6156 1.0766 1.3532 8.0921 1.8265 2.8561 1.0815 1.0833 1.0696 1.0374 1.0849 1.0871 1.0984 1.0993 1.0865 1.0926 1.0990 1.0444 1.0661 1.0666 1.1056
irintensity: 0.7012 0.6774 1.7068 2.1372 0.9366 2.9874 13.1942 6.8138 5.1803 3.2772 19.7086 68.4845 87.1829 15.6609 73.3754 5.4926 1.8130 1.1445 30.7877 5.3837 11.1538 15.1063 1.0089 8.4655 243.6505 5.3294 1.7063 15.9027 3.1566 4.8019 8.7801 32.9623 20.3109 15.5041 17.0076 3.8219 20.7447 21.0979 19.1338 104.9743 33.0111 30.7516 7.0802 13.5276 39.7615 21.7105 169.0478 19.0661 17.0648 8.9910 76.3945 81.4832 31.4267 41.7133 1.8591 21.7375 82.3644 19.6026 14.2452 37.0071 24.3819 40.7901 2.2899 99.2842 12.3391 15.6818 4.0752 17.1128 45.5701 14.2160 58.7438 25.3302 8.6855 20.7115 41.3330 3.1530 61.9440 11.1221 49.1165 7.9573 116.3302 49.2866 32.2434 646.4673 71.2881 43.9314 936.6037 21.6837 10.7363 24.6060 34.2688 21.5388 2.8066 10.5632 3.2796 139.7924 5.1141 6.1723 52.9925
temp: 298.150 k
press: 1.00000 atm
elementType: 8 8 8 8 7 7 7 7 7 6 6 6 6 6 6 6 6 6 6 6 1 1 1 1 1 1 1 1 1 1 1 1 1 1 1
symmnumber: 1
zpe: 710605.5 jmol-1
zpe.correction: 0.270655 hartree
zpe.thermalcorrener: 0.288989 hartree
zpe.thermalcorrenthalpy: 0.289934 hartree
zpe.thermalcorrgfe: 0.224222 hartree
zpe.sumelectzpe: -1001.309530 hartree
zpe.sumelectthermal: -1001.291196 hartree
zpe.sumelectthermalent: -1001.290252 hartree
zpe.sumelectthermalfe: -1001.355964 hartree
dipole: 0.3757 -4.1849 -0.8276
dipole: 4.2825
quadrupole: -91.2242 -128.1692 -112.1821
quadrupole: -7.4249 5.3314 -4.1367
quadrupole: 19.3010 -17.6441 -1.6569 -7.4249 5.3314 -4.1367
hfenergy: -1001.5801857 hartree
pointgroup: C01 [X(C11H15N5O4)]
dipole: 0.1130096 -1.6710344 -0.183326 debye
polarizability: 232.0754645|-4.9395315|163.8985235|2.3975106|6.8695435|104.4949649 unknown
InChI: InChI=1S/C11H15N5O4/c1-4(17)8-6(18)7(19)11(20-8)16-3-15-5-9(12)13-2-14-10(5)16/h2-4,6-8,11,17-19H,12H2,1H3
charge 0 multiplicity 1
35 atoms
O  1.815042 -1.089791 -0.420449
O  3.298032 1.947505 -1.657551
O  0.76063 2.361486 0.34625
O  3.589817 -0.338724 1.725975
N  -0.468585 -0.642698 -0.005731
N  -2.195142 -2.116134 -0.362443
N  -1.796715 1.450755 0.294997
N  -4.207013 1.05093 0.098958
N  -5.120864 -1.083704 -0.332983
C  3.093455 -0.336063 -0.618654
C  2.739799 1.186113 -0.542127
C  1.197811 1.229294 -0.420732
C  0.899337 -0.150796 0.235447
C  4.141282 -0.764443 0.421356
C  4.436195 -2.271051 0.397636
C  -1.643645 0.108405 0.066049
C  -0.859848 -1.969743 -0.259545
C  -2.697284 -0.818705 -0.154962
C  -4.023478 -0.295161 -0.132652
C  -3.109494 1.835094 0.295865
H  3.45549 -0.600658 -1.628341
H  3.171808 1.645275 0.359387
H  0.748776 1.208061 -1.445266
H  1.105728 -0.101888 1.32291
H  5.068005 -0.187864 0.200088
H  4.843342 -2.577002 -0.583849
H  5.183139 -2.543153 1.167275
H  3.508162 -2.837711 0.583375
H  2.738854 1.805893 -2.464388
H  -0.259026 2.291805 0.406113
H  -0.123931 -2.760126 -0.372678
H  4.189901 -0.64093 2.451739
H  -3.30282 2.896375 0.47407
H  -5.00362 -2.080115 -0.50616
H  -6.046441 -0.660532 -0.305378
