program: Gaussian 09
title: 000227024
version: EM64L-G09RevD.01
frameworkgroup: C1[X(C18H17N3O3S2)]
method: RPBEPBE
basis: SDD
operation: Freq
keyword: #p
keyword: freq=noraman
keyword: PBEPBE/SDD
title: #p freq=noraman PBEPBE/SDD
converged: YES YES NO NO
title: Mulliken charges:
elementType: S S O O O N N N C C C C C C C C C C C C C C C C C C H H H H H H H H H H H H H H H H H
charge: 1.024098 0.268862 -0.545346 -0.497694 -0.242990 -0.582702 0.006089 -0.445267 0.424184 0.404989 -0.411953 0.102666 -0.092914 -0.768717 -0.344065 -0.275494 -0.191670 -0.233087 0.508638 -0.335149 -0.426022 -0.801933 -0.252143 -0.239041 0.222747 -0.796405 0.258118 0.297549 0.242615 0.282044 0.290473 0.327285 0.322361 0.232290 0.248027 0.250660 0.236001 0.233922 0.229459 0.314883 0.241440 0.274156 0.239036
chargesum: 0.00000
title: Mulliken charges with hydrogens summed into heavy atoms:
elementType: S S O O O N N N C C C C C C C C C C C C C C C C C C
charge: 1.024098 0.268862 -0.545346 -0.497694 -0.242990 -0.255418 0.006089 -0.130384 0.424184 0.404989 -0.411953 0.102666 -0.092914 -0.510599 -0.046516 -0.032879 0.090373 0.057385 0.508638 -0.012788 -0.193732 -0.067245 -0.018221 -0.009582 0.222747 -0.041773
polarizability: 3.22437433e+02 2.67010971e+01 3.14734019e+02 1.11872178e+01 -1.93214382e+01 2.38063417e+02
1716.lowfreq: -184.2909 -74.5894 -5.4318 -0.0019 -0.0008 -0.0005 3.1220 5.4288 13.3582
frequency: -184.2905 -74.5852 13.1385 17.2998 26.0137 43.8013 45.4102 66.1837 76.2895 89.1617 101.6104 105.9430 137.4778 143.1691 172.4089 176.9564 195.7233 206.3733 208.1462 225.6440 264.2026 289.3048 309.4674 318.0798 339.5974 358.1281 362.4625 387.8543 396.4364 411.9252 429.1408 440.4451 446.3290 478.3500 488.8679 516.6910 523.3381 547.4433 556.5114 582.4771 585.6608 618.5600 635.7892 651.6595 672.5485 685.6994 719.6319 723.4399 747.2810 758.1473 767.8995 774.4494 808.8051 811.8143 820.4672 834.0834 854.6078 878.5826 909.4227 928.2174 960.4488 964.1495 970.9477 981.4060 988.2358 991.7804 993.5886 1002.5825 1023.7262 1027.4662 1033.4644 1042.8380 1050.4814 1095.4811 1122.1007 1130.1408 1159.8403 1181.3480 1183.3814 1215.9978 1237.2344 1262.4605 1264.3865 1291.2354 1297.4821 1368.5986 1374.4422 1378.9607 1383.4274 1391.1729 1406.6712 1426.7846 1446.7236 1452.7348 1467.0385 1467.9615 1474.6104 1480.8779 1504.5938 1519.7258 1555.3176 1568.3396 1592.2383 1599.6802 1600.8645 1642.5270 2962.8567 2989.1741 3035.0200 3074.1051 3115.9189 3123.6661 3132.4763 3138.7901 3146.0635 3162.0048 3162.8504 3169.7104 3178.8689 3199.8643 3228.5077 3377.2347 3521.4105
redmass: 2.3661 1.0374 6.5388 6.6506 4.8675 5.3413 7.0338 3.8581 4.9515 4.6938 4.9920 1.5003 2.8472 5.8869 5.6734 6.7368 5.5221 4.6487 6.4827 4.3812 4.6509 6.0362 5.1718 4.8296 5.1404 4.0576 5.4390 6.0916 5.4064 2.9567 3.4787 7.7730 8.3301 4.5693 8.6046 3.3167 3.2190 4.3484 4.7121 2.9929 5.4270 6.9892 3.1885 1.1881 6.0887 6.5121 4.4913 3.8176 2.1978 3.1888 1.5269 1.8020 7.7777 5.1710 6.1348 1.3561 1.5047 1.3474 3.8315 6.4703 1.3665 1.3715 11.2407 2.3724 2.4981 1.4954 2.3496 1.3324 2.5592 1.5482 1.6705 3.2004 2.3903 3.5855 1.3199 1.6133 1.3515 1.2453 1.1270 3.4126 1.7960 1.4914 1.8137 1.4815 1.4201 3.9694 3.3141 1.2500 5.2185 1.3071 4.8791 2.6236 1.1316 2.5261 1.1902 1.0473 2.2834 1.1094 2.0489 5.4287 7.4623 7.2183 6.3451 5.6080 6.8263 5.1942 1.0408 1.0386 1.0970 1.0983 1.0947 1.0901 1.0857 1.0979 1.0912 1.0951 1.0975 1.0915 1.0968 1.0955 1.0943 1.0765 1.0765
irintensity: 123.2351 0.1158 0.8798 0.6927 3.6084 2.7589 2.6500 0.2135 6.5507 0.1577 7.0178 0.4208 3.7005 3.3428 1.7477 3.8980 7.3314 2.1335 6.2030 3.2115 18.3796 10.5606 7.0545 8.8457 25.9948 6.8708 2.1184 11.8540 17.2254 0.4448 3.1789 31.2725 69.4614 0.7990 1.5259 10.8469 32.4405 41.5038 89.7890 0.4278 31.5078 5.1763 1.2026 60.9311 1.5176 7.7510 34.3408 18.0821 74.5695 68.4383 31.9791 34.2654 130.9466 2.0136 58.6070 22.5697 48.1497 3.5788 2.0564 4.6223 5.0308 2.9248 72.4824 21.4106 8.8379 2.4569 2.5199 2.2154 14.9791 1.8241 8.0438 9.0929 38.5460 26.0244 10.2962 1.1266 6.6170 0.9217 29.4535 71.5658 36.9738 10.8762 49.0525 7.1029 53.1792 198.3192 0.8346 76.3519 4.9042 31.9050 18.3207 23.2007 40.5853 10.2238 11.2160 20.5199 56.8202 35.2848 382.2282 38.2486 1.3035 0.3458 98.1981 33.2809 1.7623 103.1107 18.3822 6.5594 15.9243 12.5525 13.8832 16.1424 2.1664 5.4767 10.9183 6.6318 18.7258 4.0736 12.2329 8.6881 2.9398 12.9362 15.9913
temp: 298.150 k
press: 1.00000 atm
elementType: 16 16 8 8 8 7 7 7 6 6 6 6 6 6 6 6 6 6 6 6 6 6 6 6 6 6 1 1 1 1 1 1 1 1 1 1 1 1 1 1 1 1 1
symmnumber: 1
zpe: 825295.2 jmol-1
zpe.correction: 0.314338 hartree
zpe.thermalcorrener: 0.338768 hartree
zpe.thermalcorrenthalpy: 0.339712 hartree
zpe.thermalcorrgfe: 0.256968 hartree
zpe.sumelectzpe: -1880.120657 hartree
zpe.sumelectthermal: -1880.096228 hartree
zpe.sumelectthermalent: -1880.095284 hartree
zpe.sumelectthermalfe: -1880.178028 hartree
dipole: 4.7694 -2.3387 -6.6358
dipole: 8.5001
quadrupole: -126.4845 -184.6467 -159.6384
quadrupole: -8.3746 -11.7453 -15.8442
quadrupole: 30.4387 -27.7235 -2.7152 -8.3746 -11.7453 -15.8442
hfenergy: -1880.4349957 hartree
pointgroup: C01 [X(C18H17N3O3S2)]
dipole: -1.9320567 0.8850268 -2.5821436 debye
polarizability: 324.0001178|26.2926178|313.8612814|-14.9185969|15.1913683|237.373471 unknown
InChI: InChI=1S/C18H17N3O3S2/c1-12(17-11-25-18-6-4-3-5-16(17)18)20-21-26(23,24)15-9-7-14(8-10-15)19-13(2)22/h3-11,19,21H,1-2H3
charge 0 multiplicity 1
43 atoms
S  -0.801093 -2.909597 0.932628
S  4.776122 1.608436 -1.807678
O  -1.543191 -4.313144 0.579384
O  -0.129286 -2.568311 2.361929
O  -3.615056 3.525214 0.227491
N  0.583661 -2.903737 -0.314137
N  1.362448 -1.795697 -0.304669
N  -4.594742 1.576135 -0.645636
C  3.203662 0.491787 0.078838
C  3.127274 -0.391093 -1.09827
C  4.052288 1.623282 -0.140888
C  2.321556 -1.620516 -1.205113
C  -1.944895 -1.496426 0.454501
C  3.910984 0.073426 -2.147829
C  2.597989 0.353785 1.360798
C  4.294888 2.600079 0.844957
C  -1.618029 -0.187156 0.845921
C  -3.102776 -1.81767 -0.27516
C  -3.669416 0.575294 -0.254189
C  -2.486594 0.862967 0.48529
C  -3.969115 -0.767552 -0.625443
C  2.575586 -2.643695 -2.29987
C  2.837287 1.322571 2.353707
C  3.672722 2.443923 2.101119
C  -4.549081 2.960388 -0.406198
C  -5.738477 3.719778 -0.99066
H  4.029625 -0.360409 -3.139092
H  1.960705 -0.510807 1.560016
H  4.949582 3.454731 0.646408
H  -0.71149 0.015043 1.4238
H  -3.323788 -2.857869 -0.534693
H  0.378371 -3.515078 -1.120979
H  -2.266272 1.893756 0.766001
H  -4.886371 -0.990799 -1.184393
H  2.613979 -3.661524 -1.863931
H  3.532436 -2.469301 -2.812719
H  1.772272 -2.63626 -3.064525
H  2.373591 1.205523 3.33926
H  3.842758 3.188944 2.885956
H  -5.40729 1.241507 -1.169881
H  -5.768506 3.628923 -2.092416
H  -5.638349 4.782317 -0.728129
H  -6.696668 3.342733 -0.587608
