program: Gaussian 09
title: 000227023
version: EM64L-G09RevD.01
frameworkgroup: C1[X(C17H22N4O2S)]
method: RPBEPBE
basis: SDD
operation: Freq
keyword: #p
keyword: freq=noraman
keyword: PBEPBE/SDD
title: #p freq=noraman PBEPBE/SDD
converged: YES YES NO NO
title: Mulliken charges:
elementType: S O O N N N N C C C C C C C C C C C C C C C C C H H H H H H H H H H H H H H H H H H H H H H
charge: 0.937552 -0.547527 -0.529298 -0.152577 -0.444693 -0.018784 -0.689001 0.457606 -0.398038 -0.398551 -0.366090 -0.351726 -0.660086 -0.659725 0.473294 -0.420335 -0.394436 -0.091838 -0.370504 -0.204364 -0.206673 0.513012 -0.387475 -0.390833 0.228624 0.222836 0.226470 0.222704 0.227884 0.226829 0.217395 0.240578 0.216246 0.217858 0.241550 0.216389 0.221070 0.264663 0.207051 0.275990 0.279967 0.268680 0.227667 0.226561 0.312365 0.311711
chargesum: 0.00000
title: Mulliken charges with hydrogens summed into heavy atoms:
elementType: S O O N N N N C C C C C C C C C C C C C C C C C
charge: 0.937552 -0.547527 -0.529298 -0.152577 -0.176013 -0.018784 -0.064925 0.457606 0.053422 0.050622 -0.138206 -0.124897 0.014132 0.016073 0.473294 -0.199265 -0.129773 -0.091838 -0.163453 0.071626 0.073294 0.513012 -0.159808 -0.164271
polarizability: 5.44906429e+02 1.76840606e+01 2.91907692e+02 1.51345420e+01 1.48742741e+01 1.66898964e+02
1716.lowfreq: -10.2260 -4.0788 -2.9808 -0.0015 0.0009 0.0013 6.8537 12.2695 21.6534
frequency: 3.0065 11.2825 21.6340 32.6189 46.6563 54.6729 68.1232 85.1260 102.5149 109.3637 112.9672 131.4900 145.8028 169.3686 180.6867 202.8442 216.6651 224.8215 227.5989 278.5504 279.3846 290.4322 304.6835 324.6623 345.3649 384.8706 392.3212 401.0089 405.4282 409.6185 411.4062 412.6378 425.8659 431.5658 466.9000 513.6683 519.9073 527.3703 546.7674 567.4934 605.6574 623.0226 632.3795 703.8489 720.9797 736.5791 784.1711 786.6660 795.0181 802.3442 807.8288 814.8645 823.4546 825.1368 833.4857 868.0514 890.8038 910.0965 923.4728 935.9651 950.2352 954.1424 967.4389 977.2084 983.2099 994.1365 1013.1561 1017.6250 1020.7842 1056.1544 1073.1989 1076.5773 1093.9874 1129.9332 1132.6865 1160.3018 1182.4759 1197.8667 1201.9676 1255.1691 1267.0447 1283.4212 1286.7918 1299.6904 1319.6289 1323.9249 1340.8853 1350.3560 1362.2073 1376.6336 1384.9222 1388.6845 1399.8422 1403.3194 1434.1620 1448.5642 1466.4451 1467.8875 1477.9474 1483.2570 1490.3075 1493.4928 1502.7587 1516.1953 1537.1006 1562.6116 1587.5924 1614.8655 1628.8771 1646.4407 2962.9645 2984.1776 2984.5391 2991.5025 2997.9328 3041.0617 3046.7740 3080.1272 3081.0365 3093.0503 3094.8482 3110.1238 3116.0402 3131.6993 3134.2358 3145.9372 3161.5149 3163.7537 3166.7939 3169.1200 3563.7077 3703.1769
redmass: 4.7862 4.3633 4.2748 4.5040 5.3936 3.0350 6.2691 3.8034 3.7456 3.8349 3.8468 6.4622 8.8999 6.4103 2.8320 4.0280 1.1567 1.2521 6.3664 3.2704 4.6374 4.5427 3.2521 4.4547 3.3310 6.2653 4.6083 1.0233 3.0733 1.6104 3.5007 2.7918 3.4986 3.5640 2.8975 3.0261 2.8237 3.7438 2.9614 3.5613 6.4680 6.9124 7.0231 4.0597 2.9020 3.4942 1.1319 1.2488 5.0125 1.3738 3.5438 1.2640 2.4210 1.6077 1.8695 3.1668 2.2866 1.5725 2.1504 14.7788 1.4448 1.3643 1.3644 1.3474 4.7529 2.9240 3.1251 3.2306 1.4363 2.5661 2.1748 1.8174 1.6745 1.1954 1.5231 1.9387 1.1173 1.2389 2.0002 1.4960 1.3780 1.3861 1.2139 1.2902 2.6601 1.3577 1.2829 1.3356 2.4629 2.5148 1.2218 1.2599 5.6171 2.1624 3.7471 3.8632 1.0500 1.0440 1.0704 1.0485 2.9272 1.0926 1.3965 2.1771 4.7601 5.1104 7.4039 4.7318 6.1025 1.2366 1.0863 1.0357 1.0357 1.0607 1.0611 1.1024 1.1021 1.0998 1.0995 1.1011 1.1007 1.0726 1.0890 1.0895 1.0893 1.0871 1.0931 1.0953 1.0962 1.0956 1.0451 1.1040
irintensity: 1.9389 0.7026 0.1300 0.2549 1.3032 1.5556 2.5998 1.0384 1.0269 0.3642 2.3739 0.0510 34.8847 20.6292 28.9804 36.9370 0.4657 0.3049 19.2145 23.6078 12.7383 27.3439 1.7634 0.1275 22.0260 86.9598 15.7560 1.3901 7.8220 153.8356 7.6192 8.7312 157.0754 87.2945 17.3886 16.8736 43.9991 16.9595 7.1773 7.2001 32.8366 0.2783 1.0329 2.0633 0.4558 0.7514 4.4595 63.7606 145.3828 22.3895 34.6269 0.3612 123.3372 62.0952 69.2109 47.4997 0.3238 23.8340 3.0606 67.9548 8.2723 1.3385 0.4065 3.2515 3.9301 2.3642 19.7569 49.6753 1.6162 73.0795 13.2099 47.3866 18.8978 12.2031 0.8296 40.6859 76.0332 96.7955 63.7600 9.4122 124.2511 7.1150 5.6352 4.1001 86.4537 15.8680 16.1512 164.3867 17.9366 24.4751 7.6771 30.9515 7.0485 108.1137 1.4160 67.5157 3.2654 12.3801 1.4551 2.1912 84.5951 32.0870 126.1432 330.3394 2.4127 47.4585 8.6622 179.0877 600.2901 275.2805 59.7716 35.0406 30.5318 53.7136 84.2514 6.7260 9.3468 46.0769 47.3676 17.3313 81.2129 82.2920 14.6828 13.5853 20.1070 5.2507 33.3266 2.0039 12.0247 19.7447 114.2949 23.6184
temp: 298.150 k
press: 1.00000 atm
elementType: 16 8 8 7 7 7 7 6 6 6 6 6 6 6 6 6 6 6 6 6 6 6 6 6 1 1 1 1 1 1 1 1 1 1 1 1 1 1 1 1 1 1 1 1 1 1
symmnumber: 1
zpe: 957725.5 jmol-1
zpe.correction: 0.364778 hartree
zpe.thermalcorrener: 0.390253 hartree
zpe.thermalcorrenthalpy: 0.391197 hartree
zpe.thermalcorrgfe: 0.304269 hartree
zpe.sumelectzpe: -1426.539260 hartree
zpe.sumelectthermal: -1426.513785 hartree
zpe.sumelectthermalent: -1426.512841 hartree
zpe.sumelectthermalfe: -1426.599769 hartree
dipole: 6.0165 7.7799 -2.3160
dipole: 10.1040
quadrupole: -110.0547 -128.0069 -157.7612
quadrupole: -34.7913 14.0533 10.8862
quadrupole: 21.8862 3.9340 -25.8203 -34.7913 14.0533 10.8862
hfenergy: -1426.9040384 hartree
pointgroup: C01 [X(C17H22N4O2S1)]
dipole: 2.4222332 -3.1125693 0.4969627 debye
polarizability: 544.9979849|-11.1842726|285.7725881|-21.0484884|29.8352848|172.9425118 unknown
InChI: InChI=1S/C17H22N4O2S/c1-3-21(4-2)16-9-5-14(6-10-16)13-19-20-24(22,23)17-11-7-15(18)8-12-17/h5-13,20H,3-4,18H2,1-2H3
charge 0 multiplicity 1
46 atoms
S  -3.522438 1.792642 -0.211294
O  -4.685871 2.759774 0.400866
O  -2.877755 2.05338 -1.6890
N  5.268308 -0.549935 -0.151515
N  -2.134053 1.852833 1.231934
N  -0.964952 1.253386 0.816024
N  -5.368813 -3.961184 0.016982
C  4.032229 0.02121 0.162155
C  5.372352 -1.815164 -0.907767
C  6.540752 0.088983 0.243271
C  3.9377 1.303811 0.798061
C  2.797785 -0.655195 -0.134754
C  5.322005 -3.076027 -0.012614
C  7.047419 1.138056 -0.774566
C  1.470864 1.200291 0.796464
C  2.690805 1.865286 1.108585
C  1.560795 -0.079262 0.171477
C  -4.073838 0.023661 -0.12685
C  0.196957 1.830976 1.103494
C  -5.024541 -0.341393 0.843801
C  -3.537927 -0.892255 -1.049817
C  -4.938099 -2.639891 -0.030114
C  -5.45845 -1.676722 0.888665
C  -3.975559 -2.226602 -1.001552
H  4.575678 -1.855221 -1.672808
H  6.32922 -1.79695 -1.462936
H  6.428969 0.54663 1.243335
H  7.297919 -0.709972 0.35542
H  4.840274 1.871978 1.038625
H  2.811033 -1.647292 -0.594601
H  6.147007 -3.068272 0.722508
H  4.371847 -3.129269 0.54657
H  5.417418 -3.991124 -0.626227
H  7.217966 0.675283 -1.763447
H  6.313639 1.95198 -0.905313
H  8.001913 1.579793 -0.432998
H  2.657484 2.850557 1.591425
H  0.630921 -0.610265 -0.057299
H  0.234032 2.809065 1.6283
H  -5.424831 0.409537 1.532241
H  -2.810827 -0.555567 -1.795373
H  -2.080059 2.884142 1.449076
H  -6.202602 -1.981745 1.633469
H  -3.575158 -2.956828 -1.714382
H  -6.057726 -4.261781 0.700404
H  -5.009192 -4.650835 -0.636528
