program: Gaussian 09
title: 000227022
version: EM64L-G09RevD.01
frameworkgroup: C1[X(C17H19N3O4S)]
method: RPBEPBE
basis: SDD
operation: Freq
keyword: #p
keyword: freq=noraman
keyword: PBEPBE/SDD
title: #p freq=noraman PBEPBE/SDD
converged: YES YES NO NO
title: Mulliken charges:
elementType: S O O O O N N N C C C C C C C C C C C C C C C C C H H H H H H H H H H H H H H H H H H H
charge: 0.986596 -0.549611 -0.500210 -0.258424 -0.244448 -0.475356 -0.046195 -0.454656 -0.101531 -0.209604 -0.229001 0.501798 -0.327166 -0.422598 0.351365 0.078054 -0.375706 -0.320790 -0.804473 0.323509 -0.369996 -0.355992 0.231053 -0.778614 -0.537516 0.283446 0.285811 0.320521 0.231287 0.301475 0.216908 0.267259 0.307515 0.262216 0.246676 0.239991 0.239211 0.254199 0.262541 0.264644 0.214641 0.222927 0.247457 0.220786
chargesum: 0.00000
title: Mulliken charges with hydrogens summed into heavy atoms:
elementType: S O O O O N N N C C C C C C C C C C C C C C C C C
charge: 0.986596 -0.549611 -0.500210 -0.258424 -0.244448 -0.173881 -0.046195 -0.147142 -0.101531 0.073842 0.056810 0.501798 -0.006645 -0.191311 0.351365 0.078054 -0.158798 -0.053531 -0.055589 0.323509 -0.130784 -0.101793 0.231053 -0.036788 0.153654
polarizability: 3.17840473e+02 3.57819063e+01 3.35472016e+02 -1.70772317e+00 1.75149430e+01 1.90888262e+02
1716.lowfreq: -6.5602 -3.2229 0.0005 0.0014 0.0016 4.5019 8.4937 15.8322 24.0671
frequency: 5.6208 15.7326 24.0229 37.1936 45.6957 55.6936 60.3218 73.9763 76.5472 80.1040 88.3983 102.1827 121.2483 140.2659 157.6955 172.4018 180.7642 205.4849 210.0865 232.7894 269.7440 281.5070 304.3246 318.9765 327.5688 340.3976 358.9589 374.6790 379.9614 406.9445 413.7543 414.4219 455.0054 463.8844 478.3528 496.0882 526.0240 547.0452 556.8507 577.1201 596.5769 618.4559 630.6532 644.5688 647.1605 672.1519 726.3598 734.9511 766.3696 802.9605 806.7491 811.3603 824.1220 832.1550 848.5667 864.5016 929.8764 930.4739 933.9948 960.1514 970.5632 985.3802 986.5757 987.3083 994.4043 998.2591 999.5986 1026.4480 1040.9727 1050.6960 1058.2838 1073.6577 1113.1140 1119.3539 1123.7106 1157.3081 1181.2605 1185.4871 1214.0758 1235.4639 1263.1581 1276.5468 1295.2432 1302.9112 1331.8796 1368.2912 1370.4536 1390.1525 1390.8031 1406.6532 1429.0949 1437.7295 1448.4935 1463.1959 1468.1074 1468.6817 1472.8099 1474.0793 1481.7903 1499.4348 1508.4894 1539.5327 1577.5220 1593.6463 1599.4814 1621.5609 1632.5526 2961.0337 2967.0900 2996.7363 3044.5126 3049.6099 3095.8706 3103.6147 3109.5320 3123.6582 3127.5160 3140.1411 3156.1215 3159.5790 3163.6979 3164.7101 3176.6908 3197.5017 3257.3916 3533.0016
redmass: 5.4406 4.8431 3.9807 4.3446 4.2968 1.7543 1.3908 2.2593 3.6159 2.7733 5.1713 6.0307 4.5359 5.1675 7.4906 6.5415 4.9435 2.7359 6.6305 1.5805 3.0990 5.2477 5.3316 6.7846 3.6629 3.6855 3.7193 5.8315 5.0630 6.6271 2.9644 2.9764 5.3855 6.4402 3.3527 3.5593 2.8556 4.6131 2.5901 3.5627 3.0962 6.9916 6.1645 3.5716 1.2037 6.1829 3.2141 3.7059 3.7280 2.7462 1.4098 11.5619 5.2384 1.4339 1.5217 1.4269 2.8873 2.4234 2.0598 1.3637 9.5137 4.3005 3.0959 1.8847 1.6984 1.6810 1.9319 1.5593 1.6406 2.4424 4.0181 2.2310 1.2605 1.3118 1.3491 1.3180 1.1427 1.2424 3.3836 2.9617 1.8708 1.2260 1.4085 1.2845 3.7053 4.4755 4.0323 1.2258 1.2530 4.8832 3.9338 1.1835 1.0468 1.1182 1.0501 1.1906 1.0841 1.9635 1.1295 2.2760 2.3299 6.8405 7.1680 6.8007 5.7719 6.2858 5.0108 1.0330 1.0412 1.0365 1.0954 1.1040 1.0995 1.0990 1.0957 1.0898 1.0993 1.0870 1.0879 1.0950 1.0916 1.0949 1.0970 1.0953 1.0744 1.0766
irintensity: 2.3712 1.3187 1.8123 1.6082 0.7426 2.3949 0.3682 1.1101 6.1974 2.4248 2.8069 1.1590 2.4051 1.7986 8.5607 3.7206 7.2933 0.8293 5.9817 1.9970 16.1310 7.9979 12.6522 5.0171 2.2194 42.0874 38.2647 36.0075 3.4040 21.1164 0.0434 0.2701 38.7178 42.0653 42.5924 28.7326 77.1079 80.4572 19.2564 9.4448 1.6401 3.1898 7.5973 124.9929 56.1588 2.5913 0.2107 1.3319 26.7481 73.5899 32.2053 130.8927 33.9896 32.4062 62.5231 41.4585 3.9789 1.5739 4.2335 0.9360 68.5139 11.5209 28.3542 27.7287 13.3229 17.4398 5.4968 3.2165 14.7307 39.6558 1.8478 3.9017 0.2585 8.2079 7.4124 5.6219 40.9350 106.2369 64.3686 170.3692 56.4909 13.9746 51.5232 2.7999 109.0230 4.4540 240.8111 51.0869 31.6240 13.7172 41.9638 4.5585 16.3459 9.6191 13.7337 14.7007 48.0639 33.2772 41.8370 391.2680 89.6034 28.0755 17.3351 93.5762 31.7568 119.7548 105.0913 88.1692 16.5368 10.6153 13.1889 47.3659 13.1393 9.4550 15.7375 14.6846 26.4479 11.1834 2.3816 4.9274 4.6771 21.9051 3.1171 8.7245 10.1983 15.3563
temp: 298.150 k
press: 1.00000 atm
elementType: 16 8 8 8 8 7 7 7 6 6 6 6 6 6 6 6 6 6 6 6 6 6 6 6 6 1 1 1 1 1 1 1 1 1 1 1 1 1 1 1 1 1 1 1
symmnumber: 1
zpe: 873885.3 jmol-1
zpe.correction: 0.332845 hartree
zpe.thermalcorrener: 0.359071 hartree
zpe.thermalcorrenthalpy: 0.360016 hartree
zpe.thermalcorrgfe: 0.271500 hartree
zpe.sumelectzpe: -1520.389291 hartree
zpe.sumelectthermal: -1520.363065 hartree
zpe.sumelectthermalent: -1520.362121 hartree
zpe.sumelectthermalfe: -1520.450637 hartree
dipole: 2.5278 6.0090 -8.1776
dipole: 10.4580
quadrupole: -120.1061 -164.0666 -153.2163
quadrupole: -23.4320 7.6719 -0.1051
quadrupole: 25.6902 -18.2702 -7.4200 -23.4320 7.6719 -0.1051
hfenergy: -1520.7221363 hartree
pointgroup: C01 [X(C17H19N3O4S1)]
dipole: -0.5979214 2.492389 3.2186484 debye
polarizability: 311.3767547|-35.1243011|340.4917496|-10.1036175|-17.7345689|192.3322465 unknown
InChI: InChI=1S/C17H19N3O4S/c1-12(14-4-8-16(24-3)9-5-14)19-20-25(22,23)17-10-6-15(7-11-17)18-13(2)21/h4-11,18,20H,1-3H3
charge 0 multiplicity 1
44 atoms
S  1.687707 -3.271752 -0.544753
O  2.510955 -4.302184 0.414965
O  1.55077 -3.472674 -2.141897
O  -4.685022 2.872459 -0.376372
O  2.997585 3.613579 -1.292464
N  -0.097669 -3.390628 0.205419
N  -0.809389 -2.226724 0.047004
N  3.763561 2.346032 0.531089
C  2.300738 -1.522965 -0.228805
C  2.018104 -0.523775 -1.174103
C  3.04627 -1.287755 0.938972
C  3.249133 1.057556 0.230807
C  2.495728 0.78229 -0.945514
C  3.524935 0.015295 1.161896
C  -2.697742 -0.79783 0.435187
C  -1.965594 -2.062892 0.679868
C  -3.844738 -0.440208 1.19079
C  -2.255836 0.114451 -0.572848
C  -2.516196 -3.141528 1.597809
C  -4.08163 1.65133 -0.049402
C  -4.536266 0.770003 0.960796
C  -2.932509 1.315082 -0.815304
C  3.62922 3.535528 -0.200694
C  4.305451 4.748431 0.432123
C  -5.883592 3.25877 0.372667
H  1.454535 -0.764724 -2.080548
H  3.26822 -2.105903 1.631613
H  2.297785 1.587533 -1.654364
H  4.118961 0.224515 2.060193
H  0.060704 -3.77249 1.163001
H  -4.211331 -1.098385 1.985489
H  -1.372788 -0.149874 -1.16146
H  4.30042 2.412314 1.398678
H  -2.280049 -4.139003 1.181086
H  -3.608596 -3.071925 1.707953
H  -2.071977 -3.086691 2.612568
H  -5.414036 1.008249 1.568787
H  -2.599543 2.01044 -1.591741
H  3.5352 5.4998 0.67907
H  4.980725 5.207074 -0.309726
H  4.881841 4.518742 1.345017
H  -6.696063 2.518207 0.239884
H  -6.189136 4.225465 -0.053264
H  -5.662547 3.379064 1.451129
