program: Gaussian 09
title: 000227019
version: EM64L-G09RevD.01
frameworkgroup: C1[X(C16H19N3O2S)]
method: RPBEPBE
basis: SDD
operation: Freq
keyword: #p
keyword: freq=noraman
keyword: PBEPBE/SDD
title: #p freq=noraman PBEPBE/SDD
converged: YES YES NO NO
title: Mulliken charges:
elementType: S O O N N N C C C C C C C C C C C C C C C C H H H H H H H H H H H H H H H H H H H
charge: 0.997068 -0.506462 -0.553806 -0.488534 -0.018731 -0.687051 0.223492 0.299762 0.041966 0.460181 -0.564282 -0.357244 -0.121264 -0.411359 -0.821410 -0.793033 -0.167303 -0.231339 -0.811583 0.513220 -0.398804 -0.386505 0.231035 0.264769 0.232746 0.226114 0.230427 0.227763 0.301190 0.224932 0.249622 0.258732 0.278560 0.282807 0.236325 0.224567 0.223108 0.231157 0.229970 0.315404 0.313793
chargesum: 0.00000
title: Mulliken charges with hydrogens summed into heavy atoms:
elementType: S O O N N N C C C C C C C C C C C C C C C C
charge: 0.997068 -0.506462 -0.553806 -0.187344 -0.018731 -0.057854 0.223492 0.299762 0.041966 0.460181 -0.333247 -0.092475 -0.121264 -0.178612 -0.137105 -0.059748 0.111257 0.051468 -0.127583 0.513220 -0.167647 -0.156535
polarizability: 2.92594279e+02 2.67064614e+01 2.48582132e+02 -1.46969675e+01 -4.08849147e+00 2.06087385e+02
1716.lowfreq: -25.0235 -3.5834 -0.0017 0.0004 0.0013 4.6696 7.9954 15.3968 22.4964
frequency: -24.9016 15.3434 22.3592 30.2515 46.6336 56.3991 85.2630 95.5775 122.5410 129.0027 139.0881 150.4733 160.5555 193.5278 202.2882 227.6938 243.0123 256.6429 278.3668 288.9745 308.2663 327.0918 344.2863 354.7733 383.7279 398.7197 412.5939 413.3314 418.7860 432.7171 441.8315 455.1975 482.7167 518.2943 519.2569 544.8369 572.2266 586.1065 600.4089 622.5623 646.0971 715.3827 716.5291 735.9006 781.8403 803.4440 813.7650 817.6471 831.7274 835.3527 887.2941 918.3766 939.2559 948.9655 963.6042 970.0608 971.3757 980.3466 981.3795 1017.8867 1022.0836 1022.5611 1038.7671 1045.8651 1049.7186 1050.8523 1067.7647 1131.4977 1139.9918 1177.0197 1184.6344 1241.8780 1273.4367 1288.9985 1301.3511 1322.1068 1323.8564 1364.7358 1385.5983 1395.4734 1397.8927 1399.2986 1405.5863 1434.7186 1456.7021 1463.0331 1471.1596 1472.7041 1476.8974 1482.2775 1488.6306 1501.3382 1539.8093 1573.5819 1583.8633 1613.4512 1620.1807 1647.9901 2954.3709 2973.1874 2974.5581 3024.3229 3053.8221 3055.6986 3082.4519 3085.3222 3107.7741 3123.7139 3125.3880 3133.3001 3137.7046 3158.5806 3159.0628 3176.1058 3278.9853 3562.4537 3701.5435
redmass: 1.0223 5.4357 3.9543 4.2919 4.2482 4.9959 3.9076 4.3693 1.2362 4.5247 4.5023 4.5105 5.8492 2.2616 1.6565 7.2332 5.3574 2.6972 5.2029 2.5221 5.2830 4.3564 3.8944 2.5075 5.0162 3.1070 1.0401 2.8057 3.3969 1.5586 3.8186 4.8000 3.5960 2.9699 3.7277 3.0599 4.0157 3.0102 7.0111 6.9123 3.4195 3.2145 4.5821 3.3219 2.4481 6.0085 1.2730 9.6503 1.7927 1.3694 1.2976 3.1830 2.6856 1.3904 1.4893 2.5374 1.9295 1.4695 4.9359 1.5284 1.4585 1.5179 1.5645 1.7074 2.5218 2.4729 4.1954 1.1998 1.6695 1.5338 1.1163 2.2180 1.2831 1.5877 1.2981 2.5855 3.3033 6.6221 1.2223 1.2340 1.2874 5.3602 2.7477 3.7872 1.1235 1.0871 1.0866 1.0833 1.0996 1.1746 2.9222 2.2038 7.4825 6.3709 7.3460 4.8050 6.3589 1.2246 1.0418 1.0384 1.0396 1.0957 1.0950 1.0939 1.0998 1.0995 1.0909 1.0891 1.0946 1.0888 1.0899 1.0952 1.0960 1.0957 1.0747 1.0452 1.1040
irintensity: 0.5155 1.9100 0.6939 0.4967 1.1207 1.2635 0.9354 1.0753 1.2108 0.7078 0.3701 10.1615 1.5129 2.4329 4.1974 9.3927 11.4471 1.3311 11.5862 1.0175 3.1371 6.3709 37.6318 35.1190 7.9471 5.4447 2.0876 0.1528 6.4941 305.8237 122.0035 97.9648 4.0922 27.9427 6.0407 50.9877 0.5688 26.6652 23.6694 0.6580 76.1088 1.1930 3.4301 1.3968 68.7994 40.9797 3.5256 135.9422 80.9632 28.2814 1.8779 4.4854 1.6367 3.7312 9.1313 39.6219 14.2461 1.6488 6.7222 3.5602 3.7161 0.8578 2.7336 11.4201 54.8019 34.8544 6.5711 12.2502 4.1157 1.6834 39.7756 2.2073 5.9879 0.3849 4.0732 72.9865 33.3723 2.9150 26.4832 15.1778 13.4762 5.9510 2.1732 2.1446 20.9850 8.3404 17.3924 15.9967 26.1607 2.3872 63.6763 19.7479 4.3731 3.1956 7.3284 166.7334 23.5375 258.3268 15.4966 49.3661 31.2948 15.7281 19.6995 21.7355 16.7306 20.6917 32.3989 16.2650 15.3975 12.9654 12.2350 6.2458 9.3306 3.8315 4.5897 107.2598 24.6049
temp: 298.150 k
press: 1.00000 atm
elementType: 16 8 8 7 7 7 6 6 6 6 6 6 6 6 6 6 6 6 6 6 6 6 1 1 1 1 1 1 1 1 1 1 1 1 1 1 1 1 1 1 1
symmnumber: 1
zpe: 836689.8 jmol-1
zpe.correction: 0.318678 hartree
zpe.thermalcorrener: 0.341339 hartree
zpe.thermalcorrenthalpy: 0.342283 hartree
zpe.thermalcorrgfe: 0.265039 hartree
zpe.sumelectzpe: -1332.060953 hartree
zpe.sumelectthermal: -1332.038293 hartree
zpe.sumelectthermalent: -1332.037349 hartree
zpe.sumelectthermalfe: -1332.114592 hartree
dipole: 2.8659 7.5546 5.1535
dipole: 9.5836
quadrupole: -136.2634 -121.6339 -133.1920
quadrupole: -24.9442 -12.3793 -7.9836
quadrupole: -5.9003 8.7292 -2.8289 -24.9442 -12.3793 -7.9836
hfenergy: -1332.3796314 hartree
pointgroup: C01 [X(C16H19N3O2S1)]
dipole: -0.7023066 3.4540151 -1.3389995 debye
polarizability: 290.8252654|-27.7328964|248.8763965|-12.2717805|12.8091079|207.5621329 unknown
InChI: InChI=1S/C16H19N3O2S/c1-11-4-9-16(12(2)10-11)13(3)18-19-22(20,21)15-7-5-14(17)6-8-15/h4-10,19H,17H2,1-3H3
charge 0 multiplicity 1
41 atoms
S  2.489055 -2.105066 0.493955
O  2.13707 -2.57968 1.998431
O  3.593573 -2.849072 -0.445802
N  0.885996 -2.365303 -0.540792
N  -0.09827 -1.464671 -0.226032
N  3.661835 3.834264 0.555272
C  -2.253659 -0.460217 -0.50192
C  -3.026325 0.392609 -1.352089
C  -1.166709 -1.350151 -1.003371
C  -4.352935 1.150602 0.612971
C  -4.055724 1.175825 -0.771364
C  -2.53073 -0.467046 0.8941
C  2.836763 -0.273875 0.508464
C  -3.557959 0.320793 1.444389
C  -2.755005 0.542268 -2.842974
C  -1.327363 -2.205209 -2.250202
C  2.172494 0.535542 1.450199
C  3.767253 0.236599 -0.416219
C  -5.493177 1.974595 1.184824
C  3.388334 2.472369 0.539121
C  2.45123 1.911916 1.46178
C  4.04546 1.61352 -0.395862
H  -4.637077 1.839854 -1.424997
H  -1.920795 -1.11168 1.535003
H  -3.751912 0.286227 2.523332
H  -3.260254 -0.241636 -3.440041
H  -3.128938 1.515199 -3.206304
H  -1.676941 0.487828 -3.074532
H  1.198684 -2.500177 -1.524754
H  -0.627095 -1.913623 -3.060714
H  -2.348796 -2.153298 -2.651616
H  -1.106994 -3.261351 -1.994702
H  1.46224 0.094421 2.15521
H  4.277744 -0.437391 -1.112248
H  -6.439438 1.398752 1.183643
H  -5.293357 2.271292 2.229704
H  -5.668053 2.891892 0.594954
H  1.943313 2.561855 2.183293
H  4.776675 2.0313 -1.097429
H  3.204046 4.4507 1.220721
H  4.333444 4.240423 -0.090002
