program: Gaussian 09
title: 000227016
version: EM64L-G09RevD.01
frameworkgroup: C1[X(C16H17N3O4S)]
method: RPBEPBE
basis: SDD
operation: Freq
keyword: #p
keyword: freq=noraman
keyword: PBEPBE/SDD
title: #p freq=noraman PBEPBE/SDD
converged: YES YES NO NO
title: Mulliken charges:
elementType: S O O O O N N N C C C C C C C C C C C C C C C C H H H H H H H H H H H H H H H H H
charge: 0.951734 -0.539061 -0.511138 -0.258273 -0.245455 -0.476165 -0.454368 0.006298 -0.066474 -0.227882 -0.210726 0.501566 -0.320630 -0.423069 0.459430 -0.361072 -0.392939 -0.337766 0.328645 -0.347956 -0.341707 0.229674 -0.778252 -0.537492 0.283942 0.282726 0.320021 0.231146 0.288967 0.307644 0.212431 0.223371 0.269481 0.242276 0.254187 0.262985 0.263338 0.214691 0.223138 0.224278 0.248455
chargesum: 0.00000
title: Mulliken charges with hydrogens summed into heavy atoms:
elementType: S O O O O N N N C C C C C C C C C C C C C C C C
charge: 0.951734 -0.539061 -0.511138 -0.258273 -0.245455 -0.187198 -0.146724 0.006298 -0.066474 0.056059 0.072000 0.501566 -0.000609 -0.191923 0.459430 -0.148641 -0.169568 -0.068285 0.328645 -0.105680 -0.087520 0.229674 -0.037238 0.158380
polarizability: 4.10628358e+02 3.37071285e+01 3.00905555e+02 6.69764798e+00 2.58130455e+01 1.62251802e+02
1716.lowfreq: -3.3043 -1.7683 0.0004 0.0005 0.0016 5.5202 6.3214 20.1037 22.8507
frequency: 5.8809 20.0412 22.7772 39.8981 40.6391 47.6411 68.1384 74.4808 89.5796 97.8844 121.0540 138.1803 155.2016 168.7076 181.0762 196.2819 211.9773 213.9139 233.5722 254.0403 290.1406 307.0195 326.9932 341.7925 369.1797 381.3687 392.4215 412.0728 414.8787 421.6840 442.1675 466.5694 510.9009 528.0429 531.2345 549.9490 587.0381 597.9131 618.8870 630.9785 652.9976 674.8284 730.2781 734.7691 739.1808 774.6653 808.6356 809.3473 824.8836 831.0932 848.2133 862.8787 872.5867 913.2392 929.9905 946.4128 948.6625 959.6817 984.5572 986.8295 987.3177 995.7487 997.8649 1002.6303 1019.1797 1041.1076 1057.0322 1112.4092 1114.5535 1121.4499 1156.2246 1175.5738 1183.6027 1214.5955 1229.3163 1249.3718 1264.3168 1275.5620 1296.0827 1304.5153 1365.4245 1372.9239 1392.6126 1393.0444 1407.7987 1431.5492 1437.5417 1449.1197 1468.3072 1469.9675 1472.5266 1476.8953 1499.9046 1503.7556 1548.7639 1579.8918 1596.2783 1601.7326 1620.3057 1632.2927 2963.5256 2981.8277 2997.8879 3053.1358 3100.0352 3100.4121 3122.1701 3126.1635 3129.5021 3154.7594 3163.9967 3164.7853 3167.8041 3175.3173 3179.9521 3198.9048 3532.9067
redmass: 6.3357 3.7163 4.3912 2.2734 2.2348 2.8370 4.0810 5.1442 5.6996 6.5790 4.5214 4.8910 9.7679 6.8204 4.1118 3.2338 6.0223 5.1297 1.7267 2.2876 5.8865 5.8345 6.3251 6.0193 5.4193 5.2601 4.3969 4.3234 4.1603 3.1341 6.1339 4.8811 3.5828 2.6194 2.9026 4.3091 4.9461 3.1250 6.9826 7.0283 1.1916 5.8335 3.2589 3.5940 3.0806 2.5153 7.6775 1.3956 5.1983 1.4314 1.4993 3.4922 1.4387 1.5007 6.3561 1.5216 11.6229 1.3908 8.5512 1.4766 3.2592 1.7228 2.6801 1.3489 3.9389 1.6380 2.4356 1.2617 1.3289 1.3059 1.3194 1.2245 1.1271 3.4281 2.3198 2.3563 1.8853 1.2918 1.4065 1.2910 3.1409 4.1270 1.2410 2.2249 4.6883 3.6306 1.2327 1.0447 1.0525 1.1481 1.0755 2.1281 2.6224 2.2612 6.5616 6.1594 6.7910 5.8285 6.2657 4.8557 1.0329 1.0871 1.0364 1.1041 1.0997 1.0990 1.0892 1.0901 1.0996 1.0879 1.0914 1.0938 1.0954 1.0975 1.0736 1.0953 1.0767
irintensity: 1.0105 2.0908 4.7591 0.4271 1.8641 0.2029 1.4033 6.5080 0.8619 1.8047 6.5578 2.5723 14.0369 0.8555 11.1768 27.3809 4.7063 8.2614 9.3877 3.9524 9.4464 54.0647 5.7356 59.3018 21.4254 0.3626 2.6415 3.3254 4.0353 0.7787 90.6606 3.9776 68.6004 26.9776 51.7374 62.4381 21.0992 1.6613 2.7098 9.9793 55.5092 1.1948 0.5402 0.6531 119.6058 202.7140 81.3368 45.7215 23.6126 31.0714 47.8276 47.0367 55.8717 25.1589 6.6218 5.7389 62.7227 1.5397 61.3007 1.3243 4.8129 14.7541 6.3783 3.5168 5.4561 15.2147 51.1887 0.4200 9.2672 9.6628 8.3800 155.2470 27.7585 67.1844 134.7651 152.1163 71.8028 21.2353 52.5582 14.9161 34.2951 226.6889 43.8907 5.1525 14.8431 51.7735 3.6414 15.7038 17.7618 15.2835 53.2168 40.7698 134.8706 427.6489 48.0774 9.2720 104.3548 26.4772 192.2184 103.2356 99.8305 49.9481 11.0310 45.5734 13.1675 10.0107 16.4461 17.5037 21.0066 2.1688 2.6264 22.4885 6.5617 5.3941 28.2816 8.9548 16.1659
temp: 298.150 k
press: 1.00000 atm
elementType: 16 8 8 8 8 7 7 7 6 6 6 6 6 6 6 6 6 6 6 6 6 6 6 6 1 1 1 1 1 1 1 1 1 1 1 1 1 1 1 1 1
symmnumber: 1
zpe: 802503.5 jmol-1
zpe.correction: 0.305657 hartree
zpe.thermalcorrener: 0.330103 hartree
zpe.thermalcorrenthalpy: 0.331048 hartree
zpe.thermalcorrgfe: 0.246509 hartree
zpe.sumelectzpe: -1481.163723 hartree
zpe.sumelectthermal: -1481.139276 hartree
zpe.sumelectthermalent: -1481.138332 hartree
zpe.sumelectthermalfe: -1481.222871 hartree
dipole: 0.8039 3.6465 -6.0783
dipole: 7.1337
quadrupole: -75.3236 -163.3134 -152.4337
quadrupole: -15.2567 10.8064 3.4043
quadrupole: 55.0333 -32.9565 -22.0768 -15.2567 10.8064 3.4043
hfenergy: -1481.46938 hartree
pointgroup: C01 [X(C16H17N3O4S1)]
dipole: 0.384621 1.4672199 -2.3614412 debye
polarizability: 414.6318931|26.4986449|295.7885619|6.5285442|28.2120969|163.3652598 unknown
InChI: InChI=1S/C16H17N3O4S/c1-12(20)18-14-5-9-16(10-6-14)24(21,22)19-17-11-13-3-7-15(23-2)8-4-13/h3-11,18-19H,1-2H3
charge 0 multiplicity 1
41 atoms
S  -1.349119 -2.880866 0.444077
O  -2.14476 -4.17771 -0.138008
O  -0.76908 -2.829822 1.96374
O  6.116156 2.152855 0.420792
O  -3.959069 3.622386 1.054596
N  0.067459 -2.655355 -0.89442
N  -4.699969 2.080453 -0.555597
N  0.989147 -1.718464 -0.502821
C  -2.35536 -1.336513 0.144724
C  -2.141587 -0.223881 0.972307
C  -3.306779 -1.359173 -0.888741
C  -3.884303 0.951252 -0.280313
C  -2.914396 0.936106 0.761162
C  -4.076304 -0.201367 -1.095476
C  3.241041 -0.799507 -0.566955
C  2.249906 -1.824756 -0.888564
C  4.581205 -0.960279 -1.009164
C  2.910305 0.364352 0.193023
C  5.225468 1.138041 0.054421
C  5.574883 -0.006593 -0.705716
C  3.88658 1.318304 0.500741
C  -4.717034 3.326859 0.087231
C  -5.734899 4.315518 -0.474907
C  7.51359 2.021322 -0.002843
H  -1.398449 -0.269277 1.774305
H  -3.448262 -2.258377 -1.49584
H  -2.781786 1.823902 1.380957
H  -4.829743 -0.190914 -1.89267
H  0.398484 -3.631378 -1.092942
H  -5.361739 1.964908 -1.326342
H  2.596102 -2.684155 -1.497722
H  4.852966 -1.845939 -1.597242
H  1.877355 0.493561 0.530086
H  6.598357 -0.161771 -1.05905
H  3.648512 2.213198 1.083602
H  -5.204827 5.225295 -0.805091
H  -6.424256 4.615921 0.332758
H  -6.326827 3.922436 -1.319509
H  7.598888 2.007187 -1.106647
H  7.975932 1.108134 0.419096
H  8.018711 2.912305 0.397163
