program: Gaussian 09
title: 000227012
version: EM64L-G09RevD.01
frameworkgroup: C1[X(C16H15N3O5S)]
method: RPBEPBE
basis: SDD
operation: Freq
keyword: #p
keyword: freq=noraman
keyword: PBEPBE/SDD
title: #p freq=noraman PBEPBE/SDD
converged: YES YES NO NO
title: Mulliken charges:
elementType: S O O O O O N N N C C C C C C C C C C C C C C C C H H H H H H H H H H H H H H H
charge: 0.954408 -0.262416 -0.257131 -0.537823 -0.509275 -0.244459 -0.480706 -0.454430 0.008947 -0.064141 0.221369 0.175824 0.504634 -0.472701 -0.230378 -0.210509 0.501681 -0.327786 -0.393969 -0.319074 -0.422640 -0.202759 -0.364761 0.230209 -0.778184 0.289539 0.284659 0.282577 0.254002 0.230366 0.321036 0.231654 0.238891 0.242881 0.292902 0.217939 0.307918 0.263244 0.263636 0.214827
chargesum: 0.00000
title: Mulliken charges with hydrogens summed into heavy atoms:
elementType: S O O O O O N N N C C C C C C C C C C C C C C C C
charge: 0.954408 -0.262416 -0.257131 -0.537823 -0.509275 -0.244459 -0.187805 -0.146512 0.008947 -0.064141 0.221369 0.175824 0.504634 -0.183163 0.054281 0.072068 0.501681 -0.073784 -0.163604 0.001962 -0.190985 0.279013 -0.146823 0.230209 -0.036477
polarizability: 3.84506983e+02 2.63648264e+01 3.15581364e+02 2.73404079e+00 2.71188859e+01 1.64484409e+02
1716.lowfreq: -2.7857 -0.0021 -0.0017 -0.0008 2.4879 4.8293 6.5310 14.5894 25.3921
frequency: 5.6350 14.3969 25.3370 39.6560 46.6184 54.8934 58.3234 74.3494 76.4121 94.7667 105.8601 137.6581 158.1424 168.4011 184.8437 205.6464 210.7458 216.8273 238.5509 285.8546 308.4049 315.4447 342.6132 352.1765 369.8755 385.3702 411.8206 415.4957 417.9960 437.0116 456.0300 508.8079 529.2290 548.9112 566.5355 597.5259 609.0096 617.7036 618.8246 651.7044 674.5533 679.4538 721.7100 730.2323 748.1807 774.9485 801.0647 808.2003 810.0083 825.2410 830.4436 840.8281 873.5117 895.8041 915.3057 929.8877 935.0427 938.6198 950.9576 958.8658 978.4217 986.8348 995.6348 1003.4707 1021.2185 1040.8854 1056.9010 1061.6598 1067.2594 1121.2825 1123.0206 1134.6653 1183.1643 1192.2003 1214.3061 1252.2243 1261.2448 1264.5914 1284.0365 1295.6648 1361.0308 1371.7486 1372.9239 1392.2290 1401.7876 1408.0577 1449.3595 1457.8411 1469.6633 1476.2028 1478.0762 1485.9351 1502.6780 1553.3278 1595.5889 1601.5328 1605.7977 1623.3650 1632.7725 2994.0885 2998.0404 3011.5110 3100.1595 3100.5798 3103.6405 3126.6341 3138.1143 3163.9163 3168.0038 3184.2737 3190.6259 3192.9594 3198.6251 3532.2944
redmass: 6.5005 5.6118 5.0579 8.0721 3.4513 1.6224 1.7752 3.8899 5.1686 7.7384 7.6653 5.5556 9.0705 7.7097 8.6359 3.5020 6.5424 6.6048 6.8978 5.9677 5.9764 8.1332 5.8794 6.5966 4.8172 4.8902 4.8655 3.6298 5.7149 3.3092 5.9463 4.3952 2.9033 4.3528 5.9495 3.1144 4.5903 4.9441 6.9678 1.1939 5.8042 9.2030 4.2855 3.2511 2.5432 4.4232 4.7484 1.3879 6.6470 5.2630 1.4326 9.3003 1.4211 1.3780 1.5252 6.2917 2.6966 1.7038 11.6914 1.4005 4.3822 4.1881 1.7077 1.3455 4.1735 1.6396 2.4549 3.8084 1.4767 1.3034 1.0472 1.4049 1.1259 1.8120 3.4128 1.3053 3.2932 1.9283 1.2343 1.4029 1.4974 2.1696 3.2756 1.2258 2.6561 4.7478 1.0447 4.0822 1.1453 2.1528 2.8493 1.2939 2.2741 6.2076 6.8268 5.8079 7.7428 7.9872 4.8963 1.0875 1.0363 1.0571 1.0987 1.1000 1.1147 1.0902 1.0900 1.0914 1.0954 1.0953 1.0935 1.0738 1.0953 1.0768
irintensity: 1.1729 0.2518 5.0153 0.7604 0.6917 8.7354 7.9147 2.4983 5.7518 0.2997 3.5465 6.4934 6.2270 1.2645 15.8537 23.6602 6.8436 3.0864 5.4106 6.4034 55.0905 5.1907 58.7203 6.3443 2.0712 7.0541 7.4063 4.2270 26.6343 7.9810 61.9415 80.5965 53.5541 58.5828 23.9057 1.5684 12.0695 0.2999 2.8034 55.6154 1.0386 2.8768 2.1803 1.0919 215.6180 133.4243 43.4137 54.6179 69.4374 27.8350 30.9237 35.0881 47.0542 1.3967 41.2219 6.8364 29.2079 20.8388 39.9566 1.8277 135.1705 6.0956 15.3207 2.2148 4.7945 15.1660 56.8447 23.7113 5.7694 9.7187 0.4807 14.1645 39.6485 52.7847 68.5913 15.3908 236.9953 85.4589 18.5186 50.8372 20.3631 147.2471 130.9808 45.4541 12.3106 14.9897 15.8613 162.2763 15.9110 40.6793 52.7026 29.8090 449.2072 36.9112 103.4597 29.3073 2.1410 18.3912 102.2509 47.9110 10.8492 131.8493 8.5754 14.3767 29.0081 16.8237 9.0970 2.7491 6.3093 7.5772 4.3355 18.8012 9.1894 16.3868
temp: 298.150 k
press: 1.00000 atm
elementType: 16 8 8 8 8 8 7 7 7 6 6 6 6 6 6 6 6 6 6 6 6 6 6 6 6 1 1 1 1 1 1 1 1 1 1 1 1 1 1 1
symmnumber: 1
zpe: 756568.3 jmol-1
zpe.correction: 0.288162 hartree
zpe.thermalcorrener: 0.312382 hartree
zpe.thermalcorrenthalpy: 0.313326 hartree
zpe.thermalcorrgfe: 0.228838 hartree
zpe.sumelectzpe: -1555.118209 hartree
zpe.sumelectthermal: -1555.093989 hartree
zpe.sumelectthermalent: -1555.093045 hartree
zpe.sumelectthermalfe: -1555.177532 hartree
dipole: -1.2492 3.5835 -5.4430
dipole: 6.6354
quadrupole: -105.1114 -159.6253 -154.8040
quadrupole: -14.5266 18.4313 8.6580
quadrupole: 34.7355 -19.7784 -14.9571 -14.5266 18.4313 8.6580
hfenergy: -1555.4063706 hartree
pointgroup: C01 [X(C16H15N3O5S1)]
dipole: -0.3439479 1.5119213 -2.1001796 debye
polarizability: 388.6881243|19.1696311|309.6005305|7.3751937|31.1711289|166.2841003 unknown
InChI: InChI=1S/C16H15N3O5S/c1-11(20)18-13-3-5-14(6-4-13)25(21,22)19-17-9-12-2-7-15-16(8-12)24-10-23-15/h2-9,18-19H,10H2,1H3
charge 0 multiplicity 1
40 atoms
S  -1.503366 -2.906826 0.57278
O  3.930427 2.166554 0.949421
O  6.131982 1.714717 0.105363
O  -2.362846 -4.203412 0.090295
O  -0.878255 -2.785063 2.069434
O  -3.861901 3.711808 0.869352
N  -0.114307 -2.837846 -0.805803
N  -4.671933 2.121199 -0.657966
N  0.873418 -1.944571 -0.494515
C  -2.450938 -1.341972 0.199277
C  3.951393 0.922082 0.270864
C  5.252231 0.660927 -0.226656
C  3.159557 -1.140639 -0.680626
C  2.887231 0.054486 0.063564
C  -2.183045 -0.19561 0.962796
C  -3.416894 -1.383141 -0.820256
C  -3.896777 0.977703 -0.331235
C  5.541258 -0.491208 -0.961466
C  4.468236 -1.39292 -1.181668
C  -2.913786 0.98055 0.698158
C  -4.143795 -0.208835 -1.080553
C  5.338876 2.634883 0.970153
C  2.107791 -2.127002 -0.930995
C  -4.638026 3.397849 -0.077337
C  -5.622598 4.395059 -0.681725
H  1.881069 0.250085 0.440092
H  -1.431542 -0.226187 1.757764
H  -3.602689 -2.307378 -1.375581
H  6.545186 -0.684988 -1.346244
H  4.655201 -2.310859 -1.750605
H  -2.73829 1.894216 1.267696
H  -4.907546 -0.212048 -1.867903
H  5.727175 2.575718 2.003076
H  5.387655 3.650769 0.547163
H  0.14176 -3.840406 -0.975238
H  2.386941 -3.018467 -1.526433
H  -5.344451 1.992205 -1.41719
H  -5.06106 5.265186 -1.062963
H  -6.291246 4.763791 0.114938
H  -6.237992 3.982588 -1.499828
