program: Gaussian 09
title: 000227011
version: EM64L-G09RevD.01
frameworkgroup: C1[X(C15H23N3O3S)]
method: RPBEPBE
basis: SDD
operation: Freq
keyword: #p
keyword: freq=noraman
keyword: PBEPBE/SDD
title: #p freq=noraman PBEPBE/SDD
converged: YES YES NO NO
title: Mulliken charges:
elementType: S O O O N N N C C C C C C C C C C C C C C C H H H H H H H H H H H H H H H H H H H H H H H
charge: 1.005699 -0.548296 -0.492745 -0.249172 -0.487942 0.037519 -0.462440 -0.342905 -0.349336 -0.389487 -0.343525 -0.434851 -0.698771 -0.212110 -0.124027 -0.194126 -0.229543 0.514465 -0.333296 -0.429257 0.234297 -0.782191 0.199241 0.192019 0.182303 0.186597 0.208006 0.192638 0.183982 0.213119 0.225843 0.211946 0.210979 0.199919 0.216175 0.214853 0.293056 0.287208 0.290306 0.320023 0.233437 0.306248 0.216181 0.261147 0.266813
chargesum: 0.00000
title: Mulliken charges with hydrogens summed into heavy atoms:
elementType: S O O O N N N C C C C C C C C C C C C C C C
charge: 1.005699 -0.548296 -0.492745 -0.249172 -0.194886 0.037519 -0.156193 0.048356 0.019565 0.011157 0.053575 0.002938 -0.071698 0.002743 -0.124027 0.093082 0.060763 0.514465 -0.013273 -0.195820 0.234297 -0.038050
polarizability: 2.92769353e+02 4.52461390e+00 2.16029762e+02 -8.40200818e+00 1.55711022e+01 1.86269434e+02
1716.lowfreq: -12.2077 -10.4119 -7.6890 0.0010 0.0012 0.0021 5.5196 18.8102 24.6045
frequency: -3.2169 18.4857 24.2871 27.9410 29.7708 40.5672 53.9293 65.6137 75.7092 86.7557 95.8882 105.9232 108.9418 126.5161 151.6234 171.6531 177.7449 183.4023 205.9999 218.3689 221.6733 260.2979 269.2631 297.5833 320.8805 336.1588 350.6422 372.4577 389.6722 404.2374 411.1236 423.4392 450.6596 497.4853 501.9935 524.1707 546.3280 593.8893 618.2579 650.9210 672.2699 714.0164 720.1184 725.9241 745.2199 812.8559 816.5680 823.5428 826.3481 832.8246 852.9193 883.4002 897.7388 923.3588 930.3917 960.6361 963.1825 977.6761 985.9605 990.1589 993.6643 997.4779 1022.8337 1038.5591 1044.4323 1051.3206 1072.6974 1080.9359 1107.8552 1120.0188 1152.8785 1182.4355 1195.2190 1200.9677 1214.5933 1248.5420 1257.7326 1263.1336 1268.7775 1282.9258 1289.2693 1296.8411 1305.8968 1312.8229 1346.5200 1353.3529 1369.5976 1375.9708 1384.7478 1389.1038 1405.2783 1446.5411 1452.8202 1458.6185 1462.3147 1467.3396 1469.5946 1472.5785 1474.2685 1478.2990 1486.7741 1499.9515 1592.3735 1595.6422 1599.1867 1631.1144 2949.8125 2957.7348 2960.5695 2967.4828 2968.6643 2975.0987 2983.4341 2989.1201 2994.6509 3004.3995 3020.0977 3039.1422 3059.2501 3061.2160 3068.1620 3088.2540 3110.5677 3123.5575 3159.8171 3170.0746 3198.5629 3271.8388 3532.0336
redmass: 3.3748 3.3222 3.4531 2.5647 2.3912 1.7079 2.8925 4.0710 4.4701 3.3718 5.3332 2.2490 2.7615 4.6735 2.6236 5.6147 6.4504 4.0861 5.3569 6.2987 1.1228 3.1058 3.8671 5.9601 6.2718 3.4085 5.1046 3.9242 3.5387 3.3808 2.9480 4.6534 5.8515 2.0277 3.2261 2.8388 4.5853 3.0953 6.9835 1.2061 5.9493 1.7231 1.4415 2.5481 1.1992 10.0340 1.4704 3.8323 1.7189 1.3979 1.5065 1.8524 1.6436 1.4950 6.1230 2.2409 1.7547 5.5337 3.9592 1.3483 1.7706 1.6383 2.9308 1.6472 2.5643 2.4359 2.3765 2.2903 2.0504 1.3168 2.0835 1.1264 1.4522 1.4083 3.3906 1.2898 1.2742 1.8484 1.1466 1.0437 1.1531 1.4128 1.2969 1.3016 1.4834 1.6439 3.9205 1.5839 1.2195 1.2239 4.8153 1.0556 1.1003 1.0753 1.0789 1.1222 1.1123 1.0499 2.0202 1.0758 1.0848 2.2397 6.7592 7.1730 5.7416 4.9485 1.0589 1.0599 1.0595 1.0403 1.0567 1.0762 1.0751 1.0966 1.0370 1.0992 1.1031 1.1042 1.0988 1.0987 1.1007 1.0991 1.0989 1.0899 1.0952 1.0914 1.0955 1.0750 1.0766
irintensity: 0.9906 1.8099 0.4459 1.9812 1.4517 2.1994 0.5062 1.8469 7.3920 0.5653 0.9329 0.1548 0.4861 7.1949 17.6436 9.1507 8.5468 6.9717 1.8322 5.0789 0.0894 1.6483 23.0472 9.0396 4.3797 2.7732 22.3787 17.8387 19.6308 8.6821 0.2026 57.7422 109.5850 6.1655 0.6517 73.3842 60.6971 1.4879 3.4787 62.4858 1.2445 33.0814 20.3903 19.3307 7.2300 112.6586 7.9714 60.8186 9.4626 21.7892 52.3686 2.5760 20.8967 3.0774 2.3996 17.5326 14.3703 49.0832 6.1209 7.1905 10.4427 4.9810 5.8876 19.2301 24.1713 31.2960 0.0965 3.7318 4.2829 9.6310 0.9817 24.2483 0.3881 1.9807 59.0616 1.0639 2.5249 52.5724 8.4878 1.1494 0.6046 48.6409 0.4437 1.9733 3.5761 1.2249 198.9425 27.9031 3.5907 59.1328 15.3244 17.1168 16.9167 0.7387 1.7035 15.8976 5.2599 7.0864 30.8583 7.1423 20.8161 372.2343 90.2206 2.5059 26.3065 94.5891 4.6423 13.8533 6.7233 82.0813 94.9573 31.6535 60.5227 5.2607 8.9711 3.9787 3.3772 80.4203 57.5895 36.4921 74.7400 15.4124 8.3211 12.3662 6.4634 3.6337 7.9955 2.0516 15.6171
temp: 298.150 k
press: 1.00000 atm
elementType: 16 8 8 8 7 7 7 6 6 6 6 6 6 6 6 6 6 6 6 6 6 6 1 1 1 1 1 1 1 1 1 1 1 1 1 1 1 1 1 1 1 1 1 1 1
symmnumber: 1
zpe: 947040.0 jmol-1
zpe.correction: 0.360708 hartree
zpe.thermalcorrener: 0.385629 hartree
zpe.thermalcorrenthalpy: 0.386574 hartree
zpe.thermalcorrgfe: 0.302472 hartree
zpe.sumelectzpe: -1371.495953 hartree
zpe.sumelectthermal: -1371.471032 hartree
zpe.sumelectthermalent: -1371.470088 hartree
zpe.sumelectthermalfe: -1371.554190 hartree
dipole: -7.7457 2.2270 -4.8704
dipole: 9.4168
quadrupole: -158.7553 -131.9769 -142.8954
quadrupole: 26.0679 4.2663 5.7142
quadrupole: -14.2128 12.5656 1.6471 26.0679 4.2663 5.7142
hfenergy: -1371.8566616 hartree
pointgroup: C01 [X(C15H23N3O3S1)]
dipole: 2.9381623 -1.262365 -1.8706844 debye
polarizability: 292.5881077|-4.5760632|215.6521915|7.5965744|-16.8870423|186.8282498 unknown
InChI: InChI=1S/C15H23N3O3S/c1-3-4-5-6-7-12-16-18-22(20,21)15-10-8-14(9-11-15)17-13(2)19/h8-12,17-18H,3-7H2,1-2H3
charge 0 multiplicity 1
45 atoms
S  -3.304082 1.607361 -0.205352
O  -3.827918 2.267431 -1.599053
O  -3.849425 2.045562 1.248455
O  3.405501 0.947108 1.840111
N  -3.752536 -0.222883 -0.457629
N  -3.031348 -1.075527 0.34108
N  2.778221 1.715973 -0.288736
C  0.226691 -2.722634 0.099247
C  1.553283 -3.26197 -0.481355
C  -0.84228 -3.819304 0.300604
C  2.615715 -2.155778 -0.678088
C  -2.155836 -3.284316 0.943928
C  3.94732 -2.693086 -1.245984
C  -2.913904 -2.347182 0.036642
C  -1.424484 1.653375 -0.190484
C  -0.743292 1.338633 0.996874
C  -0.771355 2.003195 -1.384789
C  1.361558 1.688941 -0.204282
C  0.666338 1.352342 0.991827
C  0.634538 2.024368 -1.38245
C  3.720052 1.348329 0.683334
C  5.172352 1.448375 0.226672
H  -0.172693 -1.930785 -0.566686
H  0.427766 -2.228482 1.072228
H  1.358229 -3.76116 -1.45413
H  1.961173 -4.043759 0.19316
H  -0.433529 -4.61539 0.955035
H  -1.071936 -4.301744 -0.672349
H  2.204684 -1.379637 -1.356857
H  2.79935 -1.65376 0.293443
H  -1.922327 -2.75174 1.883771
H  -2.808103 -4.143897 1.19957
H  3.79423 -3.181727 -2.227023
H  4.689044 -1.883357 -1.385615
H  4.393303 -3.442547 -0.565408
H  -3.362704 -2.774981 -0.883288
H  -3.851592 -0.381104 -1.482573
H  -1.298986 1.091379 1.905826
H  -1.350059 2.267324 -2.275848
H  1.234893 1.102745 1.888701
H  1.170326 2.30072 -2.299029
H  3.158168 2.016638 -1.18919
H  5.307831 1.989002 -0.726125
H  5.585158 0.42938 0.115666
H  5.758164 1.953966 1.011551
