program: Gaussian 09
title: 000227009
version: EM64L-G09RevD.01
frameworkgroup: C1[X(C15H21N3O3S)]
method: RPBEPBE
basis: SDD
operation: Freq
keyword: #p
keyword: freq=noraman
keyword: PBEPBE/SDD
title: #p freq=noraman PBEPBE/SDD
converged: YES YES NO NO
title: Mulliken charges:
elementType: S O O O N N N C C C C C C C C C C C C C C C H H H H H H H H H H H H H H H H H H H H H
charge: 0.956247 -0.514588 -0.543743 -0.246249 0.002759 -0.498114 -0.454157 -0.035495 -0.419985 -0.412221 -0.513151 -0.545448 0.177109 -0.740868 -0.066964 -0.224546 -0.213520 0.500177 -0.322617 -0.424221 0.228822 -0.778693 0.210968 0.214373 0.206414 0.207160 0.216841 0.243504 0.219726 0.234651 0.219359 0.219877 0.218309 0.217233 0.295994 0.285723 0.282702 0.319333 0.230274 0.307036 0.262883 0.262607 0.214499
chargesum: 0.00000
title: Mulliken charges with hydrogens summed into heavy atoms:
elementType: S O O O N N N C C C C C C C C C C C C C C C
charge: 0.956247 -0.514588 -0.543743 -0.246249 0.002759 -0.202120 -0.147121 0.175473 0.000801 0.011780 -0.049921 -0.091438 0.177109 -0.085449 -0.066964 0.061176 0.069182 0.500177 -0.003283 -0.193947 0.228822 -0.038704
polarizability: 3.13034280e+02 -1.68555736e+01 2.26901632e+02 -7.97931715e+00 -1.63388011e+01 1.85743897e+02
1716.lowfreq: -14.1795 -6.6630 -3.1681 -0.0015 -0.0006 0.0005 9.1612 20.6053 29.2232
frequency: 8.4898 20.1938 29.0271 34.2702 44.0721 60.5857 69.4439 76.0897 98.8586 101.6869 133.6539 149.2550 168.1879 183.1488 201.2374 207.7440 215.2002 231.9277 293.0144 309.3181 333.1576 345.1162 354.3535 366.5751 375.3527 382.8961 412.4513 415.9912 429.7673 446.0816 458.8760 527.1468 539.6182 549.3375 559.0097 596.7596 618.4899 652.2482 658.1605 675.0844 719.8622 731.1322 754.6002 773.5487 805.3055 821.0814 831.2878 833.2393 871.0933 882.2453 929.7197 930.1418 941.2980 949.1732 949.6374 960.6156 976.5195 988.2126 994.6902 1001.5303 1001.6613 1012.4931 1040.6011 1057.3884 1062.8335 1100.8584 1117.8560 1121.8575 1133.2356 1177.9671 1184.4003 1213.3692 1213.9508 1253.0674 1263.4181 1273.7400 1284.5828 1296.6877 1300.4807 1310.0942 1324.5727 1346.5091 1350.3238 1354.5512 1372.4801 1388.4618 1390.3576 1406.2788 1448.5552 1448.6216 1455.6150 1462.9574 1469.3327 1469.9806 1476.2631 1482.7093 1486.9447 1501.8551 1596.0031 1601.3863 1604.7194 1631.4633 2964.4655 2969.2551 2971.6867 2976.3815 2980.0310 2991.5070 2997.4004 3035.3800 3039.5172 3045.7660 3068.1974 3070.3433 3073.6707 3097.1945 3103.3176 3124.8256 3165.7898 3167.2862 3199.6643 3228.1260 3534.3115
redmass: 4.7743 4.8050 3.0909 3.6150 1.3541 2.7029 4.5924 5.1145 6.3082 6.0065 4.8360 2.8613 5.4664 3.8396 1.8256 3.3978 3.1382 4.0023 4.4470 7.9034 3.0885 4.9641 2.3634 2.8198 2.1802 3.0388 3.8465 4.7018 4.0371 5.5398 3.5783 2.8699 3.6555 4.2215 3.1097 3.1255 6.9833 1.1929 2.6044 5.9036 2.8575 3.2856 2.9107 1.5222 8.0657 3.6560 1.8554 2.0172 1.4312 2.2105 4.0397 2.6676 1.5136 2.7715 4.1564 1.3821 2.1518 3.2660 1.8835 1.6464 1.3992 2.5980 1.6397 2.4349 1.6616 1.2125 1.9388 1.3169 1.3884 1.5839 1.1258 1.4002 3.0098 1.4672 1.8940 1.5033 1.2935 1.3997 1.3467 1.5984 1.6184 1.4511 1.5072 1.4515 4.1071 1.2219 1.2351 4.6381 1.0460 1.0891 1.0823 1.0870 1.1524 1.0796 2.1057 1.0666 1.0542 2.2524 6.7971 5.8531 8.4659 4.9238 1.0754 1.0640 1.0576 1.0430 1.0603 1.0696 1.0363 1.0985 1.1015 1.1032 1.0983 1.0993 1.0955 1.0994 1.0991 1.0901 1.0921 1.0947 1.0953 1.0737 1.0765
irintensity: 1.0101 3.9860 1.2164 1.4365 0.4642 1.0745 2.4659 3.9597 2.0194 0.6964 0.2216 6.0034 0.6076 5.0087 0.0019 9.6694 3.2101 4.2571 32.9514 4.0058 11.9513 43.6104 6.7424 2.9915 1.0417 1.7949 3.7045 5.0837 28.0615 66.1732 3.0591 67.5306 7.8245 55.3974 27.7623 1.6040 2.7539 53.1813 48.6623 3.5629 11.2723 0.5777 7.9299 0.7525 116.8732 24.3996 59.3634 65.5656 43.4709 6.2197 16.0544 30.9127 3.0120 18.0827 36.7360 0.9875 4.5239 9.8727 10.0535 7.4629 2.1540 9.3300 15.4637 46.0811 1.0139 1.0862 4.3180 9.7418 4.7870 7.4234 35.1672 10.1092 56.2190 3.4648 64.5808 5.1857 14.6217 47.6414 2.6721 1.2438 8.9437 4.4582 6.4823 0.7116 250.9961 28.2053 43.3370 15.8388 15.7636 15.3922 10.4131 14.8637 15.8016 7.3552 36.9679 20.3438 3.0040 438.0234 108.0933 22.5372 56.6475 108.8276 4.5229 7.5556 3.9622 58.9750 43.1537 73.8300 11.1269 36.9181 16.9242 69.5504 66.2345 37.6127 16.5639 13.3245 10.3458 15.9622 0.4511 8.5347 8.8704 12.2539 14.8697
temp: 298.150 k
press: 1.00000 atm
elementType: 16 8 8 8 7 7 7 6 6 6 6 6 6 6 6 6 6 6 6 6 6 6 1 1 1 1 1 1 1 1 1 1 1 1 1 1 1 1 1 1 1 1 1
symmnumber: 1
zpe: 898822.7 jmol-1
zpe.correction: 0.342343 hartree
zpe.thermalcorrener: 0.365705 hartree
zpe.thermalcorrenthalpy: 0.366649 hartree
zpe.thermalcorrgfe: 0.285460 hartree
zpe.sumelectzpe: -1370.335319 hartree
zpe.sumelectthermal: -1370.311958 hartree
zpe.sumelectthermalent: -1370.311013 hartree
zpe.sumelectthermalfe: -1370.392202 hartree
dipole: 0.3495 -5.1372 -5.3807
dipole: 7.4475
quadrupole: -93.1456 -159.0733 -140.4638
quadrupole: -0.6769 -17.8694 0.4417
quadrupole: 37.7487 -28.1790 -9.5696 -0.6769 -17.8694 0.4417
hfenergy: -1370.6776622 hartree
pointgroup: C01 [X(C15H21N3O3S1)]
dipole: 0.5400114 2.4782363 1.4669912 debye
polarizability: 314.629144|5.7645182|213.16082|-11.3205219|-25.4252519|197.8898451 unknown
InChI: InChI=1S/C15H21N3O3S/c1-11-3-5-14(6-4-11)17-18-22(20,21)15-9-7-13(8-10-15)16-12(2)19/h7-11,16,18H,3-6H2,1-2H3
charge 0 multiplicity 1
43 atoms
S  -0.270427 -2.583382 0.531163
O  -0.661086 -3.157151 -0.940573
O  -0.156179 -3.558351 1.831619
O  4.955134 1.254666 -2.200219
N  -1.896285 -0.402792 0.110774
N  -1.53014 -1.233922 1.160447
N  4.865441 0.620574 0.060288
C  -4.637973 2.760135 0.585382
C  -3.549264 2.692774 -0.521575
C  -4.249625 1.8221 1.760914
C  -3.284294 1.239845 -1.007183
C  -3.996975 0.352639 1.30709
C  -2.999827 0.314565 0.158336
C  -6.055792 2.463274 0.038353
C  1.288173 -1.56706 0.368048
C  1.63063 -1.058794 -0.894111
C  2.077127 -1.378951 1.51515
C  3.6469 -0.107624 0.114685
C  2.823955 -0.319702 -1.026675
C  3.267347 -0.643325 1.379064
C  5.461746 1.249318 -1.042034
C  6.792703 1.932342 -0.738655
H  -4.649822 3.796935 0.981431
H  -2.602588 3.111122 -0.125451
H  -3.846161 3.320001 -1.384268
H  -5.043971 1.832107 2.532131
H  -3.325952 2.204367 2.238525
H  -2.435746 1.205062 -1.711157
H  -4.17801 0.869466 -1.550513
H  -4.953951 -0.093759 0.968087
H  -3.648659 -0.236777 2.175487
H  -6.324021 3.176628 -0.762827
H  -6.137896 1.445282 -0.384288
H  -6.813518 2.553717 0.83893
H  -2.276828 -1.80442 1.620294
H  0.986212 -1.250124 -1.757419
H  1.776667 -1.81242 2.473887
H  3.127607 0.093975 -1.989235
H  3.906536 -0.485833 2.256621
H  5.373619 0.689846 0.944737
H  6.734482 2.985722 -1.060915
H  7.58587 1.452257 -1.33789
H  7.084443 1.900268 0.325444
