program: Gaussian 09
title: 000227007
version: EM64L-G09RevD.01
frameworkgroup: C1[X(C15H18N4O2S)]
method: RPBEPBE
basis: SDD
operation: Freq
keyword: #p
keyword: freq=noraman
keyword: PBEPBE/SDD
title: #p freq=noraman PBEPBE/SDD
converged: YES YES NO NO
title: Mulliken charges:
elementType: S O O N N N N C C C C C C C C C C C C C C C H H H H H H H H H H H H H H H H H H
charge: 0.942162 -0.547172 -0.527425 -0.149887 -0.454469 -0.012342 -0.688697 0.413603 -0.087182 0.474820 -0.351237 -0.336261 -0.412238 -0.385488 -0.204947 -0.208612 0.513304 -0.387231 -0.390215 -0.645913 -0.646014 -0.370133 0.237326 0.236379 0.275990 0.280059 0.220533 0.263842 0.227988 0.227026 0.274256 0.237703 0.218223 0.236458 0.217838 0.238520 0.236678 0.207996 0.312665 0.312094
chargesum: 0.00000
title: Mulliken charges with hydrogens summed into heavy atoms:
elementType: S O O N N N N C C C C C C C C C C C C C C C
charge: 0.942162 -0.547172 -0.527425 -0.149887 -0.180214 -0.012342 -0.063938 0.413603 -0.087182 0.474820 -0.113911 -0.099882 -0.191705 -0.121646 0.071043 0.071447 0.513304 -0.159243 -0.163189 0.046472 0.047021 -0.162137
polarizability: 4.85628116e+02 2.30685888e+01 2.66208149e+02 1.42381174e+01 1.64365930e+01 1.50887322e+02
1716.lowfreq: -7.4255 -2.5055 -0.0011 0.0016 0.0017 3.6433 9.6873 11.7208 24.8238
frequency: 8.3314 10.7062 24.8195 37.8475 53.0803 71.9020 78.9797 103.4413 108.1227 130.4023 146.1318 147.2327 176.4436 195.5552 202.6223 226.1061 230.6663 253.4112 285.4116 298.4012 324.8936 338.0550 388.6102 397.9798 403.1679 405.4030 409.9457 412.8156 424.8156 427.7044 457.4343 475.8361 518.9992 524.3299 532.4270 580.2112 605.1423 623.0728 632.4399 720.8487 726.0903 738.7593 789.4280 802.7872 805.0656 814.9653 815.8291 828.3083 833.5167 864.7739 910.0907 938.4933 941.7525 951.2199 953.9538 967.0224 978.5500 983.1403 994.6871 1016.5631 1021.1094 1055.5674 1055.9817 1105.6495 1109.8114 1129.3856 1132.0161 1165.2356 1182.0569 1195.6100 1252.2151 1258.5080 1279.9960 1299.0513 1319.7056 1324.6415 1362.5023 1368.7856 1384.0751 1400.4231 1429.1978 1434.4988 1447.9271 1459.1448 1464.0324 1476.3173 1489.7945 1491.4021 1504.6948 1520.7668 1540.6114 1565.6136 1587.3240 1614.8403 1631.2032 1646.9104 2942.6848 2950.2010 2968.3314 3009.4414 3012.9046 3098.7658 3108.4880 3116.2123 3131.2562 3132.5146 3134.7670 3146.8042 3164.1679 3165.9256 3166.9572 3170.2650 3564.0243 3703.4345
redmass: 4.6159 3.9653 4.0489 5.1833 5.5696 2.8158 4.2597 5.0401 1.8550 5.2741 2.8232 7.8005 4.2400 1.3765 3.4675 4.8286 3.4659 3.1161 6.4381 4.7538 4.6261 4.5211 9.4788 3.9211 1.0327 3.4177 1.7627 2.6101 2.8159 3.2035 3.9460 3.6936 3.0917 2.6135 3.4351 4.1907 6.2588 6.9141 7.1134 2.9117 4.5266 3.3930 2.6805 3.8962 1.3334 1.2791 4.6505 1.6276 1.8530 3.4880 1.5548 12.3370 3.1839 1.4464 1.3662 1.3663 1.3507 4.7757 2.9482 3.6641 1.4363 2.2432 1.6380 1.2384 1.3245 1.1940 1.4455 1.6895 1.1174 1.1294 1.5280 2.9026 1.3475 1.2916 2.6432 1.4242 2.2159 3.7619 3.0791 5.7479 1.2610 3.7130 2.5661 1.3010 1.0406 1.0462 2.9185 1.1166 1.1710 2.8072 4.6157 5.3102 7.4391 4.7785 6.0509 1.2328 1.0369 1.0393 1.0865 1.0998 1.1026 1.0961 1.0942 1.0894 1.0729 1.0894 1.0892 1.0873 1.0952 1.0932 1.0963 1.0955 1.0451 1.1040
irintensity: 2.1564 0.8241 0.1283 0.4054 1.7232 1.9721 2.6853 3.0404 3.0992 0.0832 3.2748 23.2941 41.1806 0.5829 23.0367 13.8459 9.0683 3.4347 43.1093 18.2816 10.8304 2.9738 96.4867 0.9197 4.4055 3.5192 77.6857 14.9163 244.3900 72.8324 8.1454 22.3967 50.0708 8.8587 32.3876 3.5147 28.5676 0.2482 1.6955 0.6836 0.4276 0.8937 271.0782 34.9472 14.9433 0.7264 103.5821 58.9463 69.6624 43.0507 24.6737 50.5192 43.3356 7.8057 1.1235 0.4900 1.3571 4.1126 0.6980 14.3341 1.3301 32.4698 63.6765 0.0231 1.0423 12.0129 3.2826 5.4482 75.3397 109.2591 9.4286 27.2762 12.0240 4.4579 85.3339 10.0226 108.2037 176.8998 4.3534 4.1177 16.5575 1.5919 44.8475 21.9568 0.2974 22.3239 78.2926 5.3706 21.9829 459.8367 5.2517 39.2702 8.5221 177.7304 501.3589 272.7292 104.7549 176.0629 54.3344 11.1905 72.5185 4.1350 51.1675 12.4769 70.5289 14.1952 18.1969 3.5162 1.2262 26.2175 12.1050 16.3804 113.6384 23.8775
temp: 298.150 k
press: 1.00000 atm
elementType: 16 8 8 7 7 7 7 6 6 6 6 6 6 6 6 6 6 6 6 6 6 6 1 1 1 1 1 1 1 1 1 1 1 1 1 1 1 1 1 1
symmnumber: 1
zpe: 810126.0 jmol-1
zpe.correction: 0.308561 hartree
zpe.thermalcorrener: 0.331553 hartree
zpe.thermalcorrenthalpy: 0.332497 hartree
zpe.thermalcorrgfe: 0.252154 hartree
zpe.sumelectzpe: -1348.089105 hartree
zpe.sumelectthermal: -1348.066112 hartree
zpe.sumelectthermalent: -1348.065168 hartree
zpe.sumelectthermalfe: -1348.145512 hartree
dipole: 5.2608 7.8853 -2.7252
dipole: 9.8630
quadrupole: -90.6784 -115.5842 -144.4542
quadrupole: -27.6442 14.1413 10.3379
quadrupole: 26.2272 1.3214 -27.5486 -27.6442 14.1413 10.3379
hfenergy: -1348.3976655 hartree
pointgroup: C01 [X(C15H18N4O2S1)]
dipole: 2.1610952 3.1900383 -0.4593009 debye
polarizability: 486.859679|13.3079515|254.5023157|17.2197573|36.6738197|161.361593 unknown
InChI: InChI=1S/C15H18N4O2S/c1-19(2)14-7-3-12(4-8-14)11-17-18-22(20,21)15-9-5-13(16)6-10-15/h3-11,18H,16H2,1-2H3
charge 0 multiplicity 1
40 atoms
S  -2.894294 -1.793581 0.211505
O  -4.01932 -2.765989 -0.459702
O  -2.276803 -2.087499 1.693256
N  5.822757 0.802419 0.288952
N  -1.487728 -1.784782 -1.196177
N  -0.335144 -1.182432 -0.746816
N  -4.839816 3.930365 0.100488
C  4.607867 0.206015 -0.053248
C  -3.476784 -0.033242 0.165562
C  2.095586 -1.021794 -0.751856
C  4.563014 -0.999644 -0.826873
C  3.356139 0.78159 0.355603
C  3.335039 -1.588708 -1.164006
C  2.139479 0.182167 0.012177
C  -4.403249 0.34451 -0.823588
C  -2.987769 0.862585 1.13321
C  -4.38691 2.61605 0.121943
C  -4.860191 1.672665 -0.841885
C  -3.448456 2.189862 1.11127
C  7.088569 0.195989 -0.144367
C  5.842247 2.040472 1.079982
C  0.843383 -1.675889 -1.1056
H  5.487883 -1.47528 -1.16396
H  3.342034 1.703122 0.94421
H  -4.76725 -0.391552 -1.547301
H  -2.278599 0.516027 1.891427
H  3.332805 -2.511913 -1.757871
H  1.191556 0.631219 0.326419
H  -5.58582 1.987522 -1.600708
H  -3.084491 2.904759 1.858294
H  -1.422001 -2.800044 -1.469592
H  7.208816 -0.832006 0.253542
H  7.930706 0.801819 0.224683
H  7.163661 0.145402 -1.249657
H  6.885229 2.35228 1.245933
H  5.366372 1.902425 2.07182
H  5.317918 2.868551 0.561447
H  0.915025 -2.592685 -1.727394
H  -5.511345 4.240022 -0.596108
H  -4.512816 4.606304 0.784788
